{"text_format":"1","workbook":"xlsx","n_sheets":11,"sheets":["Forside","LCA resultater","Unikke lister","Sorteret vægt","Mængde","Indtastninger","Resultater","Flet","Sorteret GWP","Data","Bygning"],"not_rendered":{"charts":13,"images":0,"macros":1,"external_links":0,"defined_names":9,"comments":1,"pivot_tables":0},"unopened":[],"bounds":{"document_bytes":16777216,"sheet_cells":100000,"rows_first":2000,"rows_last":500,"rows_between":2000,"halvings":0,"cell_chars":16384,"cell_head_chars":4096},"cells_cut":0,"cells_raw":0,"read":"whole","date_system":"1900"}

{"sheet":"Forside","index":0,"n_rows":32,"n_cols":8,"rows_kept":32,"cut":false,"hidden":false,"merged":[[22,1,23,13]]}
[]
[null,"LCAbyg resultat import"]
[]
[]
[null,"LCAbyg 5.2 resultatfil:",null,null,null,"C:\\Users\\rso\\Desktop\\Living Places, LCAbyg\\4 til 1 Planet, kun GWP\\Velux Living Places, Trækassette_CC_final_resultateksport.xlsx"]
[]
[null,"Indhent/opdater data:",null,null,null,"Vælg først LCAbyg resultatfil og tryk herefter på knappen \"Opdater\" for at indhente data!"]
[]
[null,"Slet manuel navngivning i fanen \"Unikke lister\""]
[]
[null,"Bygningsdata"]
[null,"År for ibrugtagning:",null,{"$f":"IF(Bygning!A12=\"\",\"\",Bygning!A12)","v":2022},null,{"$f":"IF(D12<2020,\"OBS! År for ibrugtagning må ikke være tidligere end 2020\",\"\")","v":""}]
[null,"Betragtningstid:",null,{"$f":"IF(Bygning!B12=\"\",\"\",Bygning!B12)","v":50},"år"]
[null,"Opvarmet etageareal, brutto:",null,{"$f":"IF(Bygning!A9=\"\",\"\",Bygning!A9)","v":147},"m²"]
[null,"Total etageareal, brutto:",null,{"$f":"IF(Bygning!B9=\"\",\"\",Bygning!B9)","v":147},"m²"]
[]
[null,"Elforbrug:",null,{"$f":"IF(Bygning!A3=\"\",\"\",Bygning!A3)","v":5.0999999999999996},"kWh/m² år"]
[null,"Varmeforbrug:",null,{"$f":"IF(Bygning!B3=\"\",\"\",Bygning!B3)","v":0},"kWh/m² år"]
[]
[]
[null,"OBS!"]
[]
[null,"Eksportfilen fra LCAbyg har for nuværende en fejl mellem indtastede mængder og resulter, som giver en fejl i dette ark. Undgå derfor LCAbyg filer, hvor der er konstruktioner/byggevarer med \"minus\" i \"medregnes i beregning\" !"]
[]
[null,"Arket kan for nuværende ikke indeholde mere end:",null,null,"Kontrol:"]
[null," - Bygningsdele:",100,null,{"$f":"IF('Unikke lister'!Q101=\"\",H26,H27)","v":"✔"},null,null,"✔"]
[null," - Konstruktioner:",200,null,{"$f":"IF('Unikke lister'!Y201=\"\",H26,H27)","v":"✔"},null,null,"✖"]
[null," - Byggevarer:",300,null,{"$f":"IF('Unikke lister'!AS301=\"\",H26,H27)","v":"✔"}]
[]
[]
[]
[null,"Version 2.0"]

{"sheet":"LCA resultater","index":1,"n_rows":56,"n_cols":30,"rows_kept":56,"cut":false,"hidden":false,"merged":[]}
[]
[null,"LCAbyg resultater",null,null,null,null,null,null,null,null,null,null,null,null,null,null,null,null,null,null,"Akkumuleret klimabelastning"]
[]
[null,null,"A1-A3","A4","A5","B4","B6","C3","C4","D","Total","Materialer","Drift",null,null,null,null,null,null,null,"År","Indlejret","Indlejret inkl. D","Drift","Total",null,"Dynamisk LCA - fremskrivningsfaktorer "]
[null,"kg CO2eq.",{"$f":"SUM(Data[GWP a1_3])","v":-27700.166209453098},{"$f":"SUM(Data[GWP a4])","v":0},{"$f":"SUM(Data[GWP a5])","v":0},{"$f":"SUM(Data[GWP b4])","v":6873.443941552101},{"$f":"(Forside!D17*Forside!D14*Betragtningstid*Bygning!K139)+(Forside!D18*Forside!D14*Betragtningstid*Bygning!L139)","v":2081.9169000000034},{"$f":"SUM(Data[GWP c3])","v":44928.53519691449},{"$f":"SUM(Data[GWP c4])","v":1738.1990942333071},{"$f":"SUM(Data[GWP d])","v":-23132.878167952207},{"$f":"SUM(C5:I5)","v":27921.928923246804},{"$f":"K5-G5","v":25840.0120232468},{"$f":"G5","v":2081.9169000000034},null,null,null,null,null,null,null,"Data indsættes manuelt fra LCAbyg i grå felter herunder!"]
[null,"tons CO2eq.",{"$f":"C5/1000","v":-27.700166209453098},{"$f":"D5/1000","v":0},{"$f":"E5/1000","v":0},6.8734439415521011,2.0819169000000035,44.928535196914488,1.738199094233307,-23.132878167952207,{"$f":"SUM(C6:I6)","v":27.921928923246799},{"$f":"K6-G6","v":25.840012023246796},{"$f":"G6","v":2.0819169000000035},null,null,null,null,null,null,null,"År","Indlejret","Indlejret inkl. D","Drift",null,null,"Faktor","Indlejret","Drift","Total"]
[null,"kg CO2eq./m² år",{"$f":"C5/Betragtningstid/Bruttoareal","v":-3.7687300965242305},0,{"$f":"E5/Betragtningstid/Bruttoareal","v":0},0.93516244102749668,{"$f":"G5/Betragtningstid/Forside!D14","v":0.28325400000000045},6.1127258771312238,0.2364896726848037,-3.1473303629866951,{"$f":"SUM(C7:I7)","v":3.798901894319294},3.5156478943192937,{"$f":"G7","v":0.28325400000000045},null,null,null,null,null,null,null,2022,-27700.166209499999,-27700.166209499999,159.23627999999999,{"$f":"(V7+X7)/1000","v":-27.540929929499999},null,1,{"$f":"V7","v":-27700.166209499999},{"$f":"X7","v":159.23627999999999},{"$f":"(AB7+AC7)/1000","v":-27.540929929499999}]
[null,"Andel",null,null,null,null,null,null,null,null,{"$f":"SUM(L8:M8)","v":1},{"$f":"L7/K7","v":0.92543792709583639},{"$f":"M7/K7","v":7.4562072904163612E-2},null,null,null,null,null,null,null,2023,-27700.166209499999,-27700.166209499999,299.13029999999998,{"$f":"(V8+X8)/1000","v":-27.401035909499999},null,0.99060000000000004,{"$f":"IF(V8=V7,V8,V7-(V7-V8)*AA8)","v":-27700.166209499999},{"$f":"X8","v":299.13029999999998},{"$f":"(AB8+AC8)/1000","v":-27.401035909499999}]
[null,"GenDk",{"$f":"SUMIF(Data[Kilde],'LCA resultater'!B9,Data[GWP a1_3])/Betragtningstid/Bruttoareal","v":0.43116264729767734},{"$f":"SUMIF(Data[Kilde],'LCA resultater'!B9,Data[GWP a4])/Betragtningstid/Bruttoareal","v":0},{"$f":"SUMIF(Data[Kilde],'LCA resultater'!B9,Data[GWP a5])/Betragtningstid/Bruttoareal","v":0},{"$f":"SUMIF(Data[Kilde],'LCA resultater'!B9,Data[GWP b4])/Betragtningstid/Bruttoareal","v":0.23031679608163266},"-",{"$f":"SUMIF(Data[Kilde],'LCA resultater'!B9,Data[GWP c3])/Betragtningstid/Bruttoareal","v":0.10878302114602359},{"$f":"SUMIF(Data[Kilde],'LCA resultater'!B9,Data[GWP c4])/Betragtningstid/Bruttoareal","v":1.8179518708095785E-3},{"$f":"SUMIF(Data[Kilde],'LCA resultater'!B9,Data[GWP d])/Betragtningstid/Bruttoareal","v":-0.26393110110471446},{"$f":"SUM(B9:H9)","v":0.77026246452533353},{"$f":"SUM(C9:I9)/$L$7","v":0.21961255495571599},null,null,null,null,null,null,null,null,2024,-27700.166209499999,-27700.166209499999,419.68205999999998,-27.280484149500001,null,0.98120000000000007,-27700.166209499999,419.68205999999998,-27.280484149500001]
[null,"EPDDanmark",{"$f":"SUMIF(Data[Kilde],'LCA resultater'!B10,Data[GWP a1_3])/Betragtningstid/Bruttoareal","v":-3.1220059898555919},{"$f":"SUMIF(Data[Kilde],'LCA resultater'!B10,Data[GWP a4])/Betragtningstid/Bruttoareal","v":0},{"$f":"SUMIF(Data[Kilde],'LCA resultater'!B10,Data[GWP a5])/Betragtningstid/Bruttoareal","v":0},{"$f":"SUMIF(Data[Kilde],'LCA resultater'!B10,Data[GWP b4])/Betragtningstid/Bruttoareal","v":0.25132018310060866},"-",{"$f":"SUMIF(Data[Kilde],'LCA resultater'!B10,Data[GWP c3])/Betragtningstid/Bruttoareal","v":3.6665984321756779},{"$f":"SUMIF(Data[Kilde],'LCA resultater'!B10,Data[GWP c4])/Betragtningstid/Bruttoareal","v":3.053267346938776E-3},{"$f":"SUMIF(Data[Kilde],'LCA resultater'!B10,Data[GWP d])/Betragtningstid/Bruttoareal","v":-2.0996762693042128},{"$f":"SUM(B10:H10)","v":0.79591262542069474},{"$f":"SUM(C10:I10)/$L$7","v":0.22725992954488713},null,null,null,null,null,null,null,null,2025,-27700.166209499999,-27700.166209499999,520.89156000000003,-27.179274649499998,null,0.97180000000000011,-27700.166209499999,520.89156000000003,-27.179274649499998]
[null,"User",{"$f":"SUMIF(Data[Kilde],'LCA resultater'!B11,Data[GWP a1_3])/Betragtningstid/Bruttoareal","v":-1.0778867539663173},{"$f":"SUMIF(Data[Kilde],'LCA resultater'!B11,Data[GWP a4])/Betragtningstid/Bruttoareal","v":0},{"$f":"SUMIF(Data[Kilde],'LCA resultater'!B11,Data[GWP a5])/Betragtningstid/Bruttoareal","v":0},{"$f":"SUMIF(Data[Kilde],'LCA resultater'!B11,Data[GWP b4])/Betragtningstid/Bruttoareal","v":0.45352546184525533},"-",{"$f":"SUMIF(Data[Kilde],'LCA resultater'!B11,Data[GWP c3])/Betragtningstid/Bruttoareal","v":2.3373444238095238},{"$f":"SUMIF(Data[Kilde],'LCA resultater'!B11,Data[GWP c4])/Betragtningstid/Bruttoareal","v":0.23161845346705534},{"$f":"SUMIF(Data[Kilde],'LCA resultater'!B11,Data[GWP d])/Betragtningstid/Bruttoareal","v":-0.78372299257776867},1.7129831316884618,0.55312751549939687,null,null,null,null,null,null,null,null,2026,-27700.166209499999,-27700.166209499999,608.90634,-27.091259869499996,null,0.96240000000000014,-27700.166209499999,608.90634,-27.091259869499996]
[null,null,null,null,null,null,null,null,null,null,null,null,null,null,null,null,null,null,null,null,2027,-27700.166209499999,-27700.166209499999,683.72640000000001,-27.0164398095,null,0.95299999999999996,-27700.166209499999,683.72640000000001,-27.0164398095]
[null,null,null,null,null,null,null,null,null,null,null,null,null,null,null,null,null,null,null,null,2028,-27700.166209499999,-27700.166209499999,745.35173999999995,-26.9548144695,null,0.94640000000000002,-27700.166209499999,745.35173999999995,-26.9548144695]
[null,null,null,null,null,null,null,null,null,null,null,null,null,null,null,null,null,null,null,null,2029,-27700.166209499999,-27700.166209499999,793.78236000000004,-26.906383849499999,null,0.93980000000000008,-27700.166209499999,793.78236000000004,-26.906383849499999]
[null,null,null,null,null,null,null,null,null,null,null,null,null,null,null,null,null,null,null,null,2030,-27700.166209499999,-27700.166209499999,829.01826000000005,-26.871147949499999,null,0.93320000000000014,-27700.166209499999,829.01826000000005,-26.871147949499999]
[null,null,null,null,null,null,null,null,null,null,null,null,null,null,null,null,null,null,null,null,2031,-27700.166209499999,-27700.166209499999,863.41449599999999,-26.836751713499996,null,0.9266000000000002,-27700.166209499999,863.41449599999999,-26.836751713499996]
[null,null,null,null,null,null,null,null,null,null,null,null,null,null,null,null,null,null,null,null,2032,-27700.166209499999,-27700.166209499999,896.97106799999995,-26.803195141500002,null,0.92,-27700.166209499999,896.97106799999995,-26.803195141500002]
[null,null,null,null,null,null,null,null,null,null,null,null,null,null,null,null,null,null,null,null,2033,-27700.166209499999,-27700.166209499999,929.68797600000005,-26.770478233499997,null,0.91200000000000003,-27700.166209499999,929.68797600000005,-26.770478233499997]
[null,null,null,null,null,null,null,null,null,null,null,null,null,null,null,null,null,null,null,null,2034,-27700.166209499999,-27700.166209499999,961.56521999999995,-26.7386009895,null,0.90400000000000003,-27700.166209499999,961.56521999999995,-26.7386009895]
[null,null,null,null,null,null,null,null,null,null,null,null,null,null,null,null,null,null,null,null,2035,-27700.166209499999,-27700.166209499999,992.6028,-26.707563409499997,null,0.89600000000000002,-27700.166209499999,992.6028,-26.707563409499997]
[null,null,null,null,null,null,null,null,null,null,null,null,null,null,null,null,null,null,null,null,2036,-27700.166209499999,-27700.166209499999,1023.475446,-26.676690763499998,null,0.88800000000000001,-27700.166209499999,1023.475446,-26.676690763499998]
[null,null,null,null,null,null,null,null,null,null,null,null,null,null,null,null,null,null,null,null,2037,-27700.166209499999,-27700.166209499999,1054.183158,-26.6459830515,null,0.88,-27700.166209499999,1054.183158,-26.6459830515]
[null,null,null,null,null,null,null,null,null,null,null,null,null,null,null,null,null,null,null,null,2038,-27700.166209499999,-27700.166209499999,1084.725936,-26.615440273499999,null,0.87180000000000002,-27700.166209499999,1084.725936,-26.615440273499999]
[null,null,null,null,null,null,null,null,null,null,null,null,null,null,null,null,null,null,null,null,2039,-27700.166209499999,-27700.166209499999,1115.1037799999999,-26.585062429499999,null,0.86360000000000003,-27700.166209499999,1115.1037799999999,-26.585062429499999]
[null,null,null,null,null,null,null,null,null,null,null,null,null,null,null,null,null,null,null,null,2040,-27700.166209499999,-27700.166209499999,1145.3166900000001,-26.554849519499999,null,0.85540000000000005,-27700.166209499999,1145.3166900000001,-26.554849519499999]
[null,null,null,null,null,null,null,null,null,null,null,null,null,null,null,null,null,null,null,null,2041,-27700.166209499999,-27700.166209499999,1175.5296000000001,-26.524636609499996,null,0.84720000000000006,-27700.166209499999,1175.5296000000001,-26.524636609499996]
[null,null,null,null,null,null,null,null,null,null,null,null,null,null,null,null,null,null,null,null,2042,-27648.6846945,-27655.3296945,1205.74251,-26.442942184500001,null,0.83899999999999997,{"$f":"IF(V27=V26,V27,V26-(V26-V27)*AA27)","v":-27656.973218414998},1205.74251,-26.451230708414997]
[null,null,null,null,null,null,null,null,null,null,null,null,null,null,null,null,null,null,null,null,2043,-27648.6846945,-27655.3296945,1235.95542,-26.412729274500002,null,0.83079999999999998,{"$f":"IF(V28=V27,V28,V27-(V27-V28)*AA28)","v":-27648.6846945},1235.95542,-26.412729274500002]
[null,null,null,null,null,null,null,null,null,null,null,null,null,null,null,null,null,null,null,null,2044,-27648.6846945,-27655.3296945,1266.16833,-26.382516364499999,null,0.8226,-27648.6846945,1266.16833,-26.382516364499999]
[null,null,null,null,null,null,null,null,null,null,null,null,null,null,null,null,null,null,null,null,2045,-27648.6846945,-27655.3296945,1296.3812399999999,-26.352303454499999,null,0.81440000000000001,-27648.6846945,1296.3812399999999,-26.352303454499999]
[null,null,null,null,null,null,null,null,null,null,null,null,null,null,null,null,null,null,null,null,2046,-27648.6846945,-27655.3296945,1326.5941499999999,-26.3220905445,null,0.80620000000000003,-27648.6846945,1326.5941499999999,-26.3220905445]
[null,null,null,null,null,null,null,null,null,null,null,null,null,null,null,null,null,null,null,null,2047,-26257.1846945,-26642.229694500002,1356.8070600000001,-24.9003776345,null,0.79800000000000004,-26538.267694499998,1356.8070600000001,-25.181460634499999]
[null,null,null,null,null,null,null,null,null,null,null,null,null,null,null,null,null,null,null,null,2048,-26257.1846945,-26642.229694500002,1387.0199700000001,-24.870164724499997,null,0.78939999999999999,-26257.1846945,1387.0199700000001,-24.870164724499997]
[null,null,null,null,null,null,null,null,null,null,null,null,null,null,null,null,null,null,null,null,2049,-26257.1846945,-26642.229694500002,1417.23288,-24.839951814500001,null,0.78079999999999994,-26257.1846945,1417.23288,-24.839951814500001]
[null,null,null,null,null,null,null,null,null,null,null,null,null,null,null,null,null,null,null,null,2050,-26257.1846945,-26642.229694500002,1447.44579,-24.809738904499998,null,0.77219999999999989,-26257.1846945,1447.44579,-24.809738904499998]
[null,null,null,null,null,null,null,null,null,null,null,null,null,null,null,null,null,null,null,null,2051,-26257.1846945,-26642.229694500002,1477.6587,-24.779525994499998,null,0.76359999999999983,-26257.1846945,1477.6587,-24.779525994499998]
[null,null,null,null,null,null,null,null,null,null,null,null,null,null,null,null,null,null,null,null,2052,-22346.204603300001,-24541.392848300002,1507.8716099999999,-20.838332993300003,null,0.755,-23304.394725644001,1507.8716099999999,-21.796523115644003]
[null,null,null,null,null,null,null,null,null,null,null,null,null,null,null,null,null,null,null,null,2053,-22346.204603300001,-24541.392848300002,1538.0845200000001,-20.8081200833,null,0.74639999999999995,-22346.204603300001,1538.0845200000001,-20.8081200833]
[null,null,null,null,null,null,null,null,null,null,null,null,null,null,null,null,null,null,null,null,2054,-22346.204603300001,-24541.392848300002,1568.2974300000001,-20.777907173300001,null,0.7377999999999999,-22346.204603300001,1568.2974300000001,-20.777907173300001]
[null,null,null,null,null,null,null,null,null,null,null,null,null,null,null,null,null,null,null,null,2055,-22346.204603300001,-24541.392848300002,1598.51034,-20.747694263300001,null,0.72919999999999985,-22346.204603300001,1598.51034,-20.747694263300001]
[null,null,null,null,null,null,null,null,null,null,null,null,null,null,null,null,null,null,null,null,2056,-22346.204603300001,-24541.392848300002,1628.72325,-20.717481353300002,null,0.7205999999999998,-22346.204603300001,1628.72325,-20.717481353300002]
[null,null,null,null,null,null,null,null,null,null,null,null,null,null,null,null,null,null,null,null,2057,-22346.204603300001,-24541.392848300002,1658.93616,-20.687268443299999,null,0.71199999999999997,-22346.204603300001,1658.93616,-20.687268443299999]
[null,null,null,null,null,null,null,null,null,null,null,null,null,null,null,null,null,null,null,null,2058,-22346.204603300001,-24541.392848300002,1689.1490699999999,-20.657055533299999,null,0.70319999999999994,-22346.204603300001,1689.1490699999999,-20.657055533299999]
[null,null,null,null,null,null,null,null,null,null,null,null,null,null,null,null,null,null,null,null,2059,-22346.204603300001,-24541.392848300002,1719.3619799999999,-20.6268426233,null,0.69439999999999991,-22346.204603300001,1719.3619799999999,-20.6268426233]
[null,null,null,null,null,null,null,null,null,null,null,null,null,null,null,null,null,null,null,null,2060,-22346.204603300001,-24541.392848300002,1749.5748900000001,-20.5966297133,null,0.68559999999999988,-22346.204603300001,1749.5748900000001,-20.5966297133]
[null,null,null,null,null,null,null,null,null,null,null,null,null,null,null,null,null,null,null,null,2061,-22346.204603300001,-24541.392848300002,1779.7878000000001,-20.566416803300001,null,0.67679999999999985,-22346.204603300001,1779.7878000000001,-20.566416803300001]
[null,null,null,null,null,null,null,null,null,null,null,null,null,null,null,null,null,null,null,null,2062,-20826.722267900001,-24252.8950559,1810.00071,-19.016721557899999,null,0.66800000000000004,-21331.1904032528,1810.00071,-19.521189693252801]
[null,null,null,null,null,null,null,null,null,null,null,null,null,null,null,null,null,null,null,null,2063,-20826.722267900001,-24252.8950559,1840.21362,-18.986508647900003,null,0.65900000000000003,-20826.722267900001,1840.21362,-18.986508647900003]
[null,null,null,null,null,null,null,null,null,null,null,null,null,null,null,null,null,null,null,null,2064,-20826.722267900001,-24252.8950559,1870.42653,-18.9562957379,null,0.65,-20826.722267900001,1870.42653,-18.9562957379]
[null,null,null,null,null,null,null,null,null,null,null,null,null,null,null,null,null,null,null,null,2065,-20826.722267900001,-24252.8950559,1900.6394399999999,-18.9260828279,null,0.64100000000000001,-20826.722267900001,1900.6394399999999,-18.9260828279]
[null,null,null,null,null,null,null,null,null,null,null,null,null,null,null,null,null,null,null,null,2066,-20826.722267900001,-24252.8950559,1930.8523499999999,-18.895869917900001,null,0.63200000000000001,-20826.722267900001,1930.8523499999999,-18.895869917900001]
[null,null,null,null,null,null,null,null,null,null,null,null,null,null,null,null,null,null,null,null,2067,-20826.722267900001,-24252.8950559,1961.0652600000001,-18.865657007900001,null,0.623,-20826.722267900001,1961.0652600000001,-18.865657007900001]
[null,null,null,null,null,null,null,null,null,null,null,null,null,null,null,null,null,null,null,null,2068,-20826.722267900001,-24252.8950559,1991.27817,-18.835444097899998,null,0.61399999999999999,-20826.722267900001,1991.27817,-18.835444097899998]
[null,null,null,null,null,null,null,null,null,null,null,null,null,null,null,null,null,null,null,null,2069,-20826.722267900001,-24252.8950559,2021.49108,-18.805231187900002,null,0.60499999999999998,-20826.722267900001,2021.49108,-18.805231187900002]
[null,null,null,null,null,null,null,null,null,null,null,null,null,null,null,null,null,null,null,null,2070,-20826.722267900001,-24252.8950559,2051.70399,-18.775018277900003,null,0.59599999999999997,-20826.722267900001,2051.70399,-18.775018277900003]
[null,null,null,null,null,null,null,null,null,null,null,null,null,null,null,null,null,null,null,null,2071,25840.012023200001,2707.1338552900002,2081.9169000000002,27.921928923199999,null,0.58699999999999997,6566.6507609756991,2081.9169000000002,8.648567660975699]

{"sheet":"Unikke lister","index":2,"n_rows":1000,"n_cols":56,"rows_kept":1000,"cut":false,"hidden":false,"merged":[[0,53,0,55],[0,33,0,35],[0,30,0,32],[0,1,0,3],[0,4,0,6],[0,9,0,11],[0,12,0,14],[0,17,0,19],[0,20,0,22],[0,50,0,52]]}
["Unik gruppe","Vægt",null,null,"GWP",null,null,null,"Unik undergruppe","Vægt",null,null,"GWP",null,null,null,"Unik bygningsdel","Vægt",null,null,"GWP",null,null,null,"Unik konstruktion","Byggevarer er del af element","Nyt navn",null,null,"Ny unikliste konstruktioner","Vægt",null,null,"GWP",null,null,null,null,null,null,null,null,null,null,"Unikke byggevarer",null,null,"Vægt","GWP","Ny unikliste byggevarer","Vægt",null,null,"GWP"]
["Navn","Sum [kg]","Procent","Rækkefølge","Sum [kg CO2]","Procent","Rækkefølge",null,"Navn","Sum [kg]","Procent","Rækkefølge","Sum [kg CO2]","Procent","Rækkefølge",null,"Navn","Sum [kg]","Procent","Rækkefølge","Sum [kg CO2]","Procent","Rækkefølge",null,"Navn","Angiv navn på byggeelement",null,"Sum [kg]","Sum [kg CO2]","Navn","Sum [kg]","Procent","Rækkefølge","Sum [kg CO2]","Procent","Rækkefølge",null,null,"Byggevare","Konstruktion","-","Ny byggevare","Vægt","GWP","Navn","Overskriv navn på byggevare",null,"Sum [kg]","Sum [kg CO2]","Navn","Sum [kg]","Procent","Rækkefølge","Sum [kg CO2]","Procent","Rækkefølge"]
["Alle bygningsgrupper",{"$f":"SUM(B4:B20)","v":46763.733222854295},null,null,{"$f":"SUM(E4:E20)","v":25840.012023246807},null,null,null,"Alle undergrupper",{"$f":"SUM(J4:J54)","v":46757.323222854291},null,null,{"$f":"SUM(M4:M54)","v":25730.726823246809},null,null,null,"Alle bygningsdele",{"$f":"SUM(R4:R54)","v":46763.733222854295},null,null,{"$f":"SUM(U4:U54)","v":25840.012023246807},null,null,null,"Alle konstruktioner",null,{"$f":"IF(Y3=\"\",\"\",IF(Z3=\"\",Y3,Z3))","v":"Alle konstruktioner"},{"$f":"SUM(AB4:AB200)","v":46763.733222854302},{"$f":"SUM(AC4:AC200)","v":25840.012023246803},"Alle konstruktioner",{"$f":"SUM(AE4:AE200)","v":46763.733222854302},null,null,{"$f":"SUM(AH4:AH200)","v":25840.012023246807},null,null,null,null,"Alle byggevarer",null,null,null,{"$f":"SUM(AQ4:AQ300)","v":46763.733222854324},{"$f":"SUM(AR4:AR300)","v":25840.012023246818},"Alle byggevarer",null,null,{"$f":"SUM(AV4:AV300)","v":46763.733222854302},{"$f":"SUM(AW4:AW300)","v":25840.012023246803},"Alle byggevarer",{"$f":"SUM(AY4:AY300)","v":46763.733222854302},null,null,{"$f":"SUM(BB4:BB300)","v":25840.012023246803}]
["Afløb",{"$f":"SUMIF(Data[Gruppe],'Unikke lister'!A4,Data[Vægt])","v":68.924999999999997},{"$f":"B4/$B$3","v":1.4738985801568787E-3},{"$f":"IF(B4=0,\"\",_xlfn.RANK.EQ(B4,$B$4:$B$20,0))","v":12},{"$f":"SUMIF(Data[Gruppe],'Unikke lister'!A4,Data[GWP sum])","v":490.9820727},{"$f":"E4/$B$3","v":1.0499206091186236E-2},{"$f":"IF(E4=0,\"\",_xlfn.RANK.EQ(E4,$E$4:$E$20,0))","v":11},null,"Faldstammer",{"$f":"SUMIF(Data[Undergruppe],'Unikke lister'!I4,Data[Vægt])","v":37.5},{"$f":"J4/$J$3","v":8.0201340485784166E-4},{"$f":"IF(J4=0,\"\",_xlfn.RANK.EQ(J4,$J$4:$J$55,0))","v":17},{"$f":"SUMIF(Data[Undergruppe],'Unikke lister'!I4,Data[GWP sum])","v":455.57100000000003},{"$f":"M4/$M$3","v":1.7705329629025778E-2},{"$f":"IF(M4=0,\"\",_xlfn.RANK.EQ(M4,$M$4:$M$55,0))","v":12},null,{"$f":"_xlfn.UNIQUE(Data[Bygningsdel],FALSE,FALSE)","v":"Afløbsrør"},{"$f":"IF(Q4=\"\",\"\",SUMIF(Data[Bygningsdel],'Unikke lister'!Q4,Data[Vægt]))","v":37.5},{"$f":"IF(Q4=\"\",\"\",R4/$R$3)","v":8.0190347124966198E-4},{"$f":"IF(Q4=\"\",\"\",_xlfn.RANK.EQ(R4,$R$4:$R$100,0))","v":19},{"$f":"IF(Q4=\"\",\"\",SUMIF(Data[Bygningsdel],'Unikke lister'!Q4,Data[GWP sum]))","v":455.57100000000003},{"$f":"IF(Q4=\"\",\"\",U4/$U$3)","v":1.7630448452970859E-2},{"$f":"IF(Q4=\"\",\"\",_xlfn.RANK.EQ(U4,$U$4:$U$100,0))","v":13},null,{"$f":"_xlfn.UNIQUE(Data[Konstruktion],FALSE,FALSE)","v":"Afløbsrør, PP"},null,{"$f":"IF(Y4=\"\",\"\",IF(Z4=\"\",Y4,Z4))","v":"Afløbsrør, PP"},{"$f":"IF(Y4=\"\",\"\",SUMIF(Data[Konstruktion],'Unikke lister'!Y4,Data[Vægt]))","v":37.5},{"$f":"IF(Y4=\"\",\"\",SUMIF(Data[Konstruktion],'Unikke lister'!Y4,Data[GWP sum]))","v":455.57100000000003},{"$f":"_xlfn.UNIQUE(AA4:AA200)","v":"Afløbsrør, PP"},{"$f":"IF(AD4=\"\",\"\",SUMIF($AA$4:$AA$200,AD4,$AB$4:$AB$200))","v":37.5},{"$f":"IF(AD4=\"\",\"\",AE4/$AE$3)","v":8.0190347124966188E-4},{"$f":"IF(AD4=\"\",\"\",_xlfn.RANK.EQ(AE4,$AE$4:$AE$200,0))","v":37},{"$f":"IF(AD4=\"\",\"\",SUMIF($AA$4:$AA$200,AD4,$AC$4:$AC$200))","v":455.57100000000003},{"$f":"IF(AD4=\"\",\"\",AH4/$AH$3)","v":1.7630448452970859E-2},{"$f":"IF(AD4=\"\",\"\",_xlfn.RANK.EQ(AH4,$AH$4:$AH$200,0))","v":13},null,null,{"$f":"Data[Byggevare]","v":"Rør, Kloakrør PP"},{"$f":"Data[Konstruktion]","v":"Afløbsrør, PP"},{"$f":"IF(AN4=\"\",\"\",IFERROR(MATCH(AN4,$AD$4:$AD$1000,0),_xlfn.XLOOKUP(AN4,$Y$4:$Y$1000,$AA$4:$AA$1000,\"\",0)))","v":1},{"$f":"IF(AN4=\"\",\"\",IF(N(AO4)=0,AO4,AM4))","v":"Rør, Kloakrør PP"},{"$f":"Data[Vægt]","v":37.5},{"$f":"Data[GWP sum]","v":455.57100000000003},{"$f":"_xlfn.UNIQUE(AP4:AP1000)","v":"Rør, Kloakrør PP"},null,{"$f":"IF(AS4=\"\",\"\",IF(AT4=\"\",AS4,AT4))","v":"Rør, Kloakrør PP"},{"$f":"IF(AS4=\"\",\"\",SUMIF($AP$4:$AP$1000,AS4,$AQ$4:$AQ$1000))","v":37.5},{"$f":"IF(AS4=\"\",\"\",SUMIF($AP$4:$AP$1000,AS4,$AR$4:$AR$1000))","v":455.57100000000003},{"$f":"_xlfn.UNIQUE(AU4:AU300)","v":"Rør, Kloakrør PP"},{"$f":"IF(AX4=\"\",\"\",SUMIF($AU$4:$AU$300,AX4,$AV$4:$AV$300))","v":37.5},{"$f":"IF(AX4=\"\",\"\",AY4/$AY$3)","v":8.0190347124966188E-4},{"$f":"IF(AX4=\"\",\"\",_xlfn.RANK.EQ(AY4,$AY$4:$AY$300,0))","v":30},{"$f":"IF(AX4=\"\",\"\",SUMIF($AU$4:$AU$300,AX4,$AW$4:$AW$300))","v":455.57100000000003},{"$f":"IF(AX4=\"\",\"\",BB4/$BB$3)","v":1.7630448452970859E-2},{"$f":"IF(AX4=\"\",\"\",_xlfn.RANK.EQ(BB4,$BB$4:$BB$300,0))","v":18}]
["Altaner og altangange",{"$f":"SUMIF(Data[Gruppe],'Unikke lister'!A5,Data[Vægt])","v":0},0,{"$f":"IF(B5=0,\"\",_xlfn.RANK.EQ(B5,$B$4:$B$20,0))","v":""},{"$f":"SUMIF(Data[Gruppe],'Unikke lister'!A5,Data[GWP sum])","v":0},0,{"$f":"IF(E5=0,\"\",_xlfn.RANK.EQ(E5,$E$4:$E$20,0))","v":""},null,"Nedløb fra tag",{"$f":"SUMIF(Data[Undergruppe],'Unikke lister'!I5,Data[Vægt])","v":31.425000000000001},{"$f":"J5/$J$3","v":6.7208723327087129E-4},{"$f":"IF(J5=0,\"\",_xlfn.RANK.EQ(J5,$J$4:$J$55,0))","v":18},{"$f":"SUMIF(Data[Undergruppe],'Unikke lister'!I5,Data[GWP sum])","v":35.411072699999998},{"$f":"M5/$M$3","v":1.3762173506893453E-3},{"$f":"IF(M5=0,\"\",_xlfn.RANK.EQ(M5,$M$4:$M$55,0))","v":17},null,"Tagrende",{"$f":"IF(Q5=\"\",\"\",SUMIF(Data[Bygningsdel],'Unikke lister'!Q5,Data[Vægt]))","v":31.425000000000001},{"$f":"IF(Q5=\"\",\"\",R5/$R$3)","v":6.7199510890721668E-4},{"$f":"IF(Q5=\"\",\"\",_xlfn.RANK.EQ(R5,$R$4:$R$100,0))","v":20},{"$f":"IF(Q5=\"\",\"\",SUMIF(Data[Bygningsdel],'Unikke lister'!Q5,Data[GWP sum]))","v":35.411072699999998},{"$f":"IF(Q5=\"\",\"\",U5/$U$3)","v":1.3703969126694928E-3},{"$f":"IF(Q5=\"\",\"\",_xlfn.RANK.EQ(U5,$U$4:$U$100,0))","v":19},null,"Nedløbsrør ",null,"Nedløbsrør ",{"$f":"IF(Y5=\"\",\"\",SUMIF(Data[Konstruktion],'Unikke lister'!Y5,Data[Vægt]))","v":7.5},{"$f":"IF(Y5=\"\",\"\",SUMIF(Data[Konstruktion],'Unikke lister'!Y5,Data[GWP sum]))","v":8.4513300000000005},"Nedløbsrør ",{"$f":"IF(AD5=\"\",\"\",SUMIF($AA$4:$AA$200,AD5,$AB$4:$AB$200))","v":7.5},{"$f":"IF(AD5=\"\",\"\",AE5/$AE$3)","v":1.6038069424993237E-4},{"$f":"IF(AD5=\"\",\"\",_xlfn.RANK.EQ(AE5,$AE$4:$AE$200,0))","v":39},{"$f":"IF(AD5=\"\",\"\",SUMIF($AA$4:$AA$200,AD5,$AC$4:$AC$200))","v":8.4513300000000005},{"$f":"IF(AD5=\"\",\"\",AH5/$AH$3)","v":3.2706370230775486E-4},{"$f":"IF(AD5=\"\",\"\",_xlfn.RANK.EQ(AH5,$AH$4:$AH$200,0))","v":40},null,null,"Stål, valsede profiler og plader","Nedløbsrør ",{"$f":"IF(AN5=\"\",\"\",IFERROR(MATCH(AN5,$AD$4:$AD$1000,0),_xlfn.XLOOKUP(AN5,$Y$4:$Y$1000,$AA$4:$AA$1000,\"\",0)))","v":2},{"$f":"IF(AN5=\"\",\"\",IF(N(AO5)=0,AO5,AM5))","v":"Stål, valsede profiler og plader"},7.5,8.4513300000000005,"Stål, valsede profiler og plader",null,{"$f":"IF(AS5=\"\",\"\",IF(AT5=\"\",AS5,AT5))","v":"Stål, valsede profiler og plader"},{"$f":"IF(AS5=\"\",\"\",SUMIF($AP$4:$AP$1000,AS5,$AQ$4:$AQ$1000))","v":31.425000000000001},{"$f":"IF(AS5=\"\",\"\",SUMIF($AP$4:$AP$1000,AS5,$AR$4:$AR$1000))","v":35.411072699999998},"Stål, valsede profiler og plader",{"$f":"IF(AX5=\"\",\"\",SUMIF($AU$4:$AU$300,AX5,$AV$4:$AV$300))","v":31.425000000000001},{"$f":"IF(AX5=\"\",\"\",AY5/$AY$3)","v":6.7199510890721657E-4},{"$f":"IF(AX5=\"\",\"\",_xlfn.RANK.EQ(AY5,$AY$4:$AY$300,0))","v":33},{"$f":"IF(AX5=\"\",\"\",SUMIF($AU$4:$AU$300,AX5,$AW$4:$AW$300))","v":35.411072699999998},{"$f":"IF(AX5=\"\",\"\",BB5/$BB$3)","v":1.370396912669493E-3},{"$f":"IF(AX5=\"\",\"\",_xlfn.RANK.EQ(BB5,$BB$4:$BB$300,0))","v":32}]
["Andet",{"$f":"SUMIF(Data[Gruppe],'Unikke lister'!A6,Data[Vægt])","v":0},0,"",{"$f":"SUMIF(Data[Gruppe],'Unikke lister'!A6,Data[GWP sum])","v":0},0,"",null,"Altanbund",{"$f":"SUMIF(Data[Undergruppe],'Unikke lister'!I6,Data[Vægt])","v":0},0,"",{"$f":"SUMIF(Data[Undergruppe],'Unikke lister'!I6,Data[GWP sum])","v":0},0,"",null,"Etagedæk, bjælkelag",{"$f":"IF(Q6=\"\",\"\",SUMIF(Data[Bygningsdel],'Unikke lister'!Q6,Data[Vægt]))","v":5343.0588000000007},0.11425646396829477,3,{"$f":"IF(Q6=\"\",\"\",SUMIF(Data[Bygningsdel],'Unikke lister'!Q6,Data[GWP sum]))","v":1200.3313305080992},4.6452429256930244E-2,8,null,"Tagrende",null,"Tagrende",{"$f":"IF(Y6=\"\",\"\",SUMIF(Data[Konstruktion],'Unikke lister'!Y6,Data[Vægt]))","v":23.925000000000001},{"$f":"IF(Y6=\"\",\"\",SUMIF(Data[Konstruktion],'Unikke lister'!Y6,Data[GWP sum]))","v":26.9597427},"Tagrende",23.925000000000001,5.1161441465728428E-4,38,26.9597427,1.043333210361738E-3,36,null,null,"Stål, valsede profiler og plader","Tagrende",3,"Stål, valsede profiler og plader",23.925000000000001,26.9597427,"Fastgørelsesmidler/skruer i galvaniseret stål",null,"Fastgørelsesmidler/skruer i galvaniseret stål",34.588719999999995,122.98683741545038,"Fastgørelsesmidler/skruer i galvaniseret stål",34.588719999999995,7.3964839024220268E-4,32,122.98683741545038,4.7595503169582916E-3,25]
["Dæk",{"$f":"SUMIF(Data[Gruppe],'Unikke lister'!A7,Data[Vægt])","v":5343.0588000000007},0.11425646396829477,3,{"$f":"SUMIF(Data[Gruppe],'Unikke lister'!A7,Data[GWP sum])","v":1200.3313305080992},2.5667996282244532E-2,8,null,"Rækværk",{"$f":"SUMIF(Data[Undergruppe],'Unikke lister'!I7,Data[Vægt])","v":0},0,"",{"$f":"SUMIF(Data[Undergruppe],'Unikke lister'!I7,Data[GWP sum])","v":0},0,"",null,"Solceller",{"$f":"IF(Q7=\"\",\"\",SUMIF(Data[Bygningsdel],'Unikke lister'!Q7,Data[Vægt]))","v":201.4},4.3067562429248514E-3,11,{"$f":"IF(Q7=\"\",\"\",SUMIF(Data[Bygningsdel],'Unikke lister'!Q7,Data[GWP sum]))","v":1639.40554},6.3444457321657544E-2,6,null,"Etagedæk 1. sal, 270 mm bjælkelag",null,"Etagedæk 1. sal, 270 mm bjælkelag",{"$f":"IF(Y7=\"\",\"\",SUMIF(Data[Konstruktion],'Unikke lister'!Y7,Data[Vægt]))","v":1072.5948000000001},{"$f":"IF(Y7=\"\",\"\",SUMIF(Data[Konstruktion],'Unikke lister'!Y7,Data[GWP sum]))","v":154.41337560209982},"Etagedæk 1. sal, 270 mm bjælkelag",1072.5948000000001,2.2936466489715649E-2,8,154.41337560209982,5.9757470493118497E-3,22,null,null,"Fastgørelsesmidler/skruer i galvaniseret stål","Etagedæk 1. sal, 270 mm bjælkelag",4,"Fastgørelsesmidler/skruer i galvaniseret stål",12.03,42.7749756021,"Savede og tørrede konstruktionstræprodukter af fyr og gran, Fobrænding","Konstruktionstræ","Konstruktionstræ",12327.578799999997,1297.6398736842093,"Konstruktionstræ",12327.578799999997,0.26361408618196636,1,1297.6398736842093,5.0218237999146279E-2,9]
["El- og mekaniske anlæg",{"$f":"SUMIF(Data[Gruppe],'Unikke lister'!A8,Data[Vægt])","v":201.4},4.3067562429248514E-3,11,{"$f":"SUMIF(Data[Gruppe],'Unikke lister'!A8,Data[GWP sum])","v":1639.40554},3.5057199821651376E-2,6,null,"Fastgørelse",{"$f":"SUMIF(Data[Undergruppe],'Unikke lister'!I8,Data[Vægt])","v":0},0,"",{"$f":"SUMIF(Data[Undergruppe],'Unikke lister'!I8,Data[GWP sum])","v":0},0,"",null,"Skruefundament",{"$f":"IF(Q8=\"\",\"\",SUMIF(Data[Bygningsdel],'Unikke lister'!Q8,Data[Vægt]))","v":1442.4387199999996},3.0845243110211171E-2,6,{"$f":"IF(Q8=\"\",\"\",SUMIF(Data[Bygningsdel],'Unikke lister'!Q8,Data[GWP sum]))","v":1038.3970388273503},4.0185625219259294E-2,10,null,"Etagedæk 2. sal, 230 mm bjælkelag",null,"Etagedæk 2. sal, 230 mm bjælkelag",{"$f":"IF(Y8=\"\",\"\",SUMIF(Data[Konstruktion],'Unikke lister'!Y8,Data[Vægt]))","v":1344.0239999999999},{"$f":"IF(Y8=\"\",\"\",SUMIF(Data[Konstruktion],'Unikke lister'!Y8,Data[GWP sum]))","v":209.79470298599961},"Etagedæk 2. sal, 230 mm bjælkelag",1344.0239999999999,2.8740733627809475E-2,7,209.79470298599961,8.1189862759064937E-3,18,null,null,"Savede og tørrede konstruktionstræprodukter af fyr og gran, Fobrænding","Etagedæk 1. sal, 270 mm bjælkelag",4,"Savede og tørrede konstruktionstræprodukter af fyr og gran, Fobrænding",621.71040000000005,65.443199999999933,"Fermacell fiberplade 12,5 mm","Fibergips","Fibergips",10095.4,917.97003362779651,"Fibergips",10095.4,0.21588096809743562,2,917.97003362779651,3.5525139570444106E-2,12]
["Fundamenter",{"$f":"SUMIF(Data[Gruppe],'Unikke lister'!A9,Data[Vægt])","v":1442.4387199999996},3.0845243110211171E-2,7,{"$f":"SUMIF(Data[Gruppe],'Unikke lister'!A9,Data[GWP sum])","v":1038.3970388273503},2.2205178399227258E-2,10,null,"Andet",{"$f":"SUMIF(Data[Undergruppe],'Unikke lister'!I9,Data[Vægt])","v":0},0,"",{"$f":"SUMIF(Data[Undergruppe],'Unikke lister'!I9,Data[GWP sum])","v":0},0,"",null,"Indervægge",{"$f":"IF(Q9=\"\",\"\",SUMIF(Data[Bygningsdel],'Unikke lister'!Q9,Data[Vægt]))","v":3311.9280000000003},7.0822574926105344E-2,5,{"$f":"IF(Q9=\"\",\"\",SUMIF(Data[Bygningsdel],'Unikke lister'!Q9,Data[GWP sum]))","v":1113.6426563877969},4.3097605968058963E-2,9,null,"Etagedæk, 70 mm gulvopbygning",null,"Etagedæk, 70 mm gulvopbygning",{"$f":"IF(Y9=\"\",\"\",SUMIF(Data[Konstruktion],'Unikke lister'!Y9,Data[Vægt]))","v":2926.4399999999996},{"$f":"IF(Y9=\"\",\"\",SUMIF(Data[Konstruktion],'Unikke lister'!Y9,Data[GWP sum]))","v":836.12325191999969},"Etagedæk, 70 mm gulvopbygning",2926.4399999999996,6.2579263850769604E-2,4,836.12325191999969,3.2357695931711894E-2,9,null,null,"Savede og tørrede konstruktionstræprodukter af fyr og gran, Fobrænding","Etagedæk 1. sal, 270 mm bjælkelag",4,"Savede og tørrede konstruktionstræprodukter af fyr og gran, Fobrænding",438.8544,46.195199999999893,"Trinlydsdug - Scan Underlay","Gulvunderlag","Gulvunderlag",117.6,58.836228640000002,"Gulvunderlag",117.6,2.5147692858389394E-3,26,58.836228640000002,2.2769427733651346E-3,30]
["Indervægge",{"$f":"SUMIF(Data[Gruppe],'Unikke lister'!A10,Data[Vægt])","v":3311.9280000000003},7.0822574926105344E-2,5,{"$f":"SUMIF(Data[Gruppe],'Unikke lister'!A10,Data[GWP sum])","v":1113.6426563877969},2.3814237650375169E-2,9,null,"Kælderdæk",{"$f":"SUMIF(Data[Undergruppe],'Unikke lister'!I10,Data[Vægt])","v":0},0,"",{"$f":"SUMIF(Data[Undergruppe],'Unikke lister'!I10,Data[GWP sum])","v":0},0,"",null,"Træsøjle",{"$f":"IF(Q10=\"\",\"\",SUMIF(Data[Bygningsdel],'Unikke lister'!Q10,Data[Vægt]))","v":52},1.111972813466198E-3,16,{"$f":"IF(Q10=\"\",\"\",SUMIF(Data[Bygningsdel],'Unikke lister'!Q10,Data[GWP sum]))","v":13.83200000000001},5.3529386857700128E-4,20,null,"Solceller, Sunpower",null,"Solceller, Sunpower",{"$f":"IF(Y10=\"\",\"\",SUMIF(Data[Konstruktion],'Unikke lister'!Y10,Data[Vægt]))","v":201.4},{"$f":"IF(Y10=\"\",\"\",SUMIF(Data[Konstruktion],'Unikke lister'!Y10,Data[GWP sum]))","v":1639.40554},"Solceller, Sunpower",201.4,4.3067562429248505E-3,26,1639.40554,6.3444457321657544E-2,5,null,null,"Fastgørelsesmidler/skruer i galvaniseret stål","Etagedæk 2. sal, 230 mm bjælkelag",5,"Fastgørelsesmidler/skruer i galvaniseret stål",19.8,70.402702985999994,"Trægulv 14 mm ask - Tarkett Sverige","Traægulv","Traægulv",955.9,557.80999999999983,"Traægulv",955.9,2.0441054084468047E-2,8,557.80999999999983,2.1587064259032448E-2,17]
["Søjler og bjælker",{"$f":"SUMIF(Data[Gruppe],'Unikke lister'!A11,Data[Vægt])","v":52},1.111972813466198E-3,13,{"$f":"SUMIF(Data[Gruppe],'Unikke lister'!A11,Data[GWP sum])","v":13.83200000000001},2.9578476838200884E-4,13,null,"Etagedæk",{"$f":"SUMIF(Data[Undergruppe],'Unikke lister'!I11,Data[Vægt])","v":5343.0588000000007},0.11427212748116411,3,{"$f":"SUMIF(Data[Undergruppe],'Unikke lister'!I11,Data[GWP sum])","v":1200.3313305080992},4.6649725005966099E-2,7,null,"Tag, trækassette",{"$f":"IF(Q11=\"\",\"\",SUMIF(Data[Bygningsdel],'Unikke lister'!Q11,Data[Vægt]))","v":12661.062},0.27074532180019167,2,{"$f":"IF(Q11=\"\",\"\",SUMIF(Data[Bygningsdel],'Unikke lister'!Q11,Data[GWP sum]))","v":5513.0640977210533},0.21335377447817203,1,null,"Krinner V114x5-M24","Skruefundament","Skruefundament",{"$f":"IF(Y11=\"\",\"\",SUMIF(Data[Konstruktion],'Unikke lister'!Y11,Data[Vægt]))","v":112},{"$f":"IF(Y11=\"\",\"\",SUMIF(Data[Konstruktion],'Unikke lister'!Y11,Data[GWP sum]))","v":126.20652800000001},"Skruefundament",750,1.6038069424993237E-2,11,845.13300000000015,3.2706370230775494E-2,8,null,null,"Savede og tørrede konstruktionstræprodukter af fyr og gran, Fobrænding","Etagedæk 2. sal, 230 mm bjælkelag",5,"Savede og tørrede konstruktionstræprodukter af fyr og gran, Fobrænding",1324.2239999999999,139.3919999999996,"WISA Gran krydsfiner, ubehandlet, Fobrænding","Krydsfiner","Krydsfiner",2867.04,1207.8720000000001,"Krydsfiner",2867.04,6.1309048752310143E-2,6,1207.8720000000001,4.6744250695910886E-2,11]
["Tage",{"$f":"SUMIF(Data[Gruppe],'Unikke lister'!A12,Data[Vægt])","v":12661.062},0.27074532180019167,2,{"$f":"SUMIF(Data[Gruppe],'Unikke lister'!A12,Data[GWP sum])","v":5513.0640977210533},0.11789187299158395,1,null,"El-anlæg",{"$f":"SUMIF(Data[Undergruppe],'Unikke lister'!I12,Data[Vægt])","v":0},0,"",{"$f":"SUMIF(Data[Undergruppe],'Unikke lister'!I12,Data[GWP sum])","v":0},0,"",null,"Terrændæk, trækassette",{"$f":"IF(Q12=\"\",\"\",SUMIF(Data[Bygningsdel],'Unikke lister'!Q12,Data[Vægt]))","v":4895.28},0.10468112065970786,4,{"$f":"IF(Q12=\"\",\"\",SUMIF(Data[Bygningsdel],'Unikke lister'!Q12,Data[GWP sum]))","v":1523.63153397},5.8964041216361444E-2,7,null,"Krinner V114x5x2000","Skruefundament","Skruefundament",{"$f":"IF(Y12=\"\",\"\",SUMIF(Data[Konstruktion],'Unikke lister'!Y12,Data[Vægt]))","v":464},{"$f":"IF(Y12=\"\",\"\",SUMIF(Data[Konstruktion],'Unikke lister'!Y12,Data[GWP sum]))","v":522.85561600000005},"Rem 200x185, limtræ",297.37936000000002,6.3591877616534093E-3,23,83.640579413675184,3.2368630222938152E-3,31,null,null,"Fermacell fiberplade 12,5 mm","Etagedæk, 70 mm gulvopbygning",6,"Fermacell fiberplade 12,5 mm",973.5,88.519902899999991,"Solceller, Sunpower",null,"Solceller, Sunpower",201.4,1639.40554,"Solceller, Sunpower",201.4,4.3067562429248505E-3,20,1639.40554,6.3444457321657557E-2,4]
["Terrændæk",{"$f":"SUMIF(Data[Gruppe],'Unikke lister'!A13,Data[Vægt])","v":4895.28},0.10468112065970786,4,{"$f":"SUMIF(Data[Gruppe],'Unikke lister'!A13,Data[GWP sum])","v":1523.63153397},3.258147775989307E-2,7,null,"Belysning",{"$f":"SUMIF(Data[Undergruppe],'Unikke lister'!I13,Data[Vægt])","v":0},0,"",{"$f":"SUMIF(Data[Undergruppe],'Unikke lister'!I13,Data[GWP sum])","v":0},0,"",null,"Trappe",{"$f":"IF(Q13=\"\",\"\",SUMIF(Data[Bygningsdel],'Unikke lister'!Q13,Data[Vægt]))","v":274.3},5.8656565910341942E-3,9,{"$f":"IF(Q13=\"\",\"\",SUMIF(Data[Bygningsdel],'Unikke lister'!Q13,Data[GWP sum]))","v":71.292105263157893},2.7589811180823132E-3,18,null,"Krinner V140x6,3-M24","Skruefundament","Skruefundament",{"$f":"IF(Y13=\"\",\"\",SUMIF(Data[Konstruktion],'Unikke lister'!Y13,Data[Vægt]))","v":30},{"$f":"IF(Y13=\"\",\"\",SUMIF(Data[Konstruktion],'Unikke lister'!Y13,Data[GWP sum]))","v":33.805320000000002},"Rem 266x185, limtræ",395.05935999999991,8.4479859235645268E-3,16,109.62345941367519,4.2423919661899977E-3,25,null,null,"Trinlydsdug - Scan Underlay","Etagedæk, 70 mm gulvopbygning",6,"Trinlydsdug - Scan Underlay",69.3,34.671349020000001,"Skruefundament",null,"Skruefundament",750,845.13300000000015,"Skruefundament",750,1.6038069424993237E-2,10,845.13300000000015,3.2706370230775494E-2,13]
["Trapper og ramper",{"$f":"SUMIF(Data[Gruppe],'Unikke lister'!A14,Data[Vægt])","v":274.3},5.8656565910341942E-3,9,{"$f":"SUMIF(Data[Gruppe],'Unikke lister'!A14,Data[GWP sum])","v":71.292105263157893},1.5245169782192695E-3,12,null,"Transportanlæg",{"$f":"SUMIF(Data[Undergruppe],'Unikke lister'!I14,Data[Vægt])","v":0},0,"",{"$f":"SUMIF(Data[Undergruppe],'Unikke lister'!I14,Data[GWP sum])","v":0},0,"",null,"Vandrør",{"$f":"IF(Q14=\"\",\"\",SUMIF(Data[Bygningsdel],'Unikke lister'!Q14,Data[Vægt]))","v":39},8.3397961009964842E-4,18,{"$f":"IF(Q14=\"\",\"\",SUMIF(Data[Bygningsdel],'Unikke lister'!Q14,Data[GWP sum]))","v":138.83618073},5.3729147109179707E-3,15,null,"Krinner V140x6,3x2000 ","Skruefundament","Skruefundament",{"$f":"IF(Y14=\"\",\"\",SUMIF(Data[Konstruktion],'Unikke lister'!Y14,Data[Vægt]))","v":144},{"$f":"IF(Y14=\"\",\"\",SUMIF(Data[Konstruktion],'Unikke lister'!Y14,Data[GWP sum]))","v":162.265536},"100 mm indervæg, fibergips",666.57500000000005,1.4254101502619822E-2,14,77.142698692796571,2.985397167129629E-3,32,null,null,"Trægulv 14 mm ask - Tarkett Sverige","Etagedæk, 70 mm gulvopbygning",6,"Trægulv 14 mm ask - Tarkett Sverige",521.4,304.25999999999982,"Limtræs-produkter af fyr og gran, Fobrænding","Limtræ","Limtræ",741.67999999999984,197.28688000000002,"Limtræ",741.67999999999984,1.5860153774838643E-2,11,197.28688000000002,7.6349376239651951E-3,22]
["Udendørs areal",{"$f":"SUMIF(Data[Gruppe],'Unikke lister'!A15,Data[Vægt])","v":0},0,"",{"$f":"SUMIF(Data[Gruppe],'Unikke lister'!A15,Data[GWP sum])","v":0},0,"",null,"Energiproduktion",{"$f":"SUMIF(Data[Undergruppe],'Unikke lister'!I15,Data[Vægt])","v":201.4},4.307346659689848E-3,11,{"$f":"SUMIF(Data[Undergruppe],'Unikke lister'!I15,Data[GWP sum])","v":1639.40554},6.3713922706561663E-2,5,null,"VVB og buffertank",{"$f":"IF(Q15=\"\",\"\",SUMIF(Data[Bygningsdel],'Unikke lister'!Q15,Data[Vægt]))","v":220},4.7045003646646833E-3,10,{"$f":"IF(Q15=\"\",\"\",SUMIF(Data[Bygningsdel],'Unikke lister'!Q15,Data[GWP sum]))","v":2077.5722000000001},8.0401363518365437E-2,5,null,"Rem 200x185, limtræ",null,"Rem 200x185, limtræ",{"$f":"IF(Y15=\"\",\"\",SUMIF(Data[Konstruktion],'Unikke lister'!Y15,Data[Vægt]))","v":297.37936000000002},{"$f":"IF(Y15=\"\",\"\",SUMIF(Data[Konstruktion],'Unikke lister'!Y15,Data[GWP sum]))","v":83.640579413675184},"100 mm indervæg, krydsfiner",820.03099999999995,1.7535618811528837E-2,9,370.26416982500001,1.4329102072084723E-2,16,null,null,"WISA Gran krydsfiner, ubehandlet, Fobrænding","Etagedæk, 70 mm gulvopbygning",6,"WISA Gran krydsfiner, ubehandlet, Fobrænding",570.24,171.072,"Træfiberisolering (bats), kl. 38 - Hunton","Træfiberisolering, bats","Træfiberisolering, bats",251.6,72.99695959999994,"Træfiberisolering, bats",251.6,5.3802376897710644E-3,19,72.99695959999994,2.8249584224004495E-3,29]
["Vand",{"$f":"SUMIF(Data[Gruppe],'Unikke lister'!A16,Data[Vægt])","v":259},5.5384799747643315E-3,10,{"$f":"SUMIF(Data[Gruppe],'Unikke lister'!A16,Data[GWP sum])","v":2216.4083807299999},4.7395881979046116E-2,4,null,"Andet (El- og mekaniske anlæg)",{"$f":"SUMIF(Data[Undergruppe],'Unikke lister'!I16,Data[Vægt])","v":0},0,"",{"$f":"SUMIF(Data[Undergruppe],'Unikke lister'!I16,Data[GWP sum])","v":0},0,"",null,"Pumpe",{"$f":"IF(Q16=\"\",\"\",SUMIF(Data[Bygningsdel],'Unikke lister'!Q16,Data[Vægt]))","v":6.41},1.3707203335227555E-4,21,{"$f":"IF(Q16=\"\",\"\",SUMIF(Data[Bygningsdel],'Unikke lister'!Q16,Data[GWP sum]))","v":109.2852},4.2293014376960135E-3,16,null,"Rem 266x185, limtræ",null,"Rem 266x185, limtræ",{"$f":"IF(Y16=\"\",\"\",SUMIF(Data[Konstruktion],'Unikke lister'!Y16,Data[Vægt]))","v":395.05935999999991},{"$f":"IF(Y16=\"\",\"\",SUMIF(Data[Konstruktion],'Unikke lister'!Y16,Data[GWP sum]))","v":109.62345941367519},"100 mm indervæg, krydsfiner og fibergips",163.315,3.4923430775236938E-3,28,36.482962525000005,1.4118786977412522E-3,34,null,null,"WISA Gran krydsfiner, ubehandlet, Fobrænding","Etagedæk, 70 mm gulvopbygning",6,"WISA Gran krydsfiner, ubehandlet, Fobrænding",792.00000000000011,237.59999999999991,"Keramikfliser, glaseret",null,"Keramikfliser, glaseret",600,189.79302000000001,"Keramikfliser, glaseret",600,1.283045553999459E-2,15,189.79302000000001,7.3449276969861288E-3,23]
["Varme",{"$f":"SUMIF(Data[Gruppe],'Unikke lister'!A17,Data[Vægt])","v":356.67750285429804},7.627224737480608E-3,8,{"$f":"SUMIF(Data[Gruppe],'Unikke lister'!A17,Data[GWP sum])","v":1759.7191415451039},3.7629997014119843E-2,5,null,"Randfundamenter",{"$f":"SUMIF(Data[Undergruppe],'Unikke lister'!I17,Data[Vægt])","v":0},0,"",{"$f":"SUMIF(Data[Undergruppe],'Unikke lister'!I17,Data[GWP sum])","v":0},0,"",null,"Radiator ",{"$f":"IF(Q17=\"\",\"\",SUMIF(Data[Bygningsdel],'Unikke lister'!Q17,Data[Vægt]))","v":141.33250285429801},3.0222673237137155E-3,13,{"$f":"IF(Q17=\"\",\"\",SUMIF(Data[Bygningsdel],'Unikke lister'!Q17,Data[GWP sum]))","v":590.63822412525394},2.2857505778011631E-2,12,null,"100 mm indervæg, fibergips",null,"100 mm indervæg, fibergips",{"$f":"IF(Y17=\"\",\"\",SUMIF(Data[Konstruktion],'Unikke lister'!Y17,Data[Vægt]))","v":666.57500000000005},{"$f":"IF(Y17=\"\",\"\",SUMIF(Data[Konstruktion],'Unikke lister'!Y17,Data[GWP sum]))","v":77.142698692796571},"110 mm indervæg mod bad, krydsfiner og fibergips med klinker ",341.77799999999996,7.3086123892471171E-3,20,96.508604250000005,3.7348513678390179E-3,29,null,null,"Solceller, Sunpower","Solceller, Sunpower",7,"Solceller, Sunpower",201.4,1639.40554,"Mørtel, fliseklæber",null,"Mørtel, fliseklæber",94.300000000000011,34.268780310000004,"Mørtel, fliseklæber",94.300000000000011,2.0165199290358166E-3,27,34.268780310000004,1.3261905713964186E-3,33]
["Ventilation og køl ",{"$f":"SUMIF(Data[Gruppe],'Unikke lister'!A18,Data[Vægt])","v":1.5249999999999999},3.261074116415292E-5,14,{"$f":"SUMIF(Data[Gruppe],'Unikke lister'!A18,Data[GWP sum])","v":4.6495068792499996},9.9425485495193531E-5,14,null,"Stribefundamenter under bærende indervægge",{"$f":"SUMIF(Data[Undergruppe],'Unikke lister'!I18,Data[Vægt])","v":0},0,"",{"$f":"SUMIF(Data[Undergruppe],'Unikke lister'!I18,Data[GWP sum])","v":0},0,"",null,"Varmepumpe",{"$f":"IF(Q18=\"\",\"\",SUMIF(Data[Bygningsdel],'Unikke lister'!Q18,Data[Vægt]))","v":83.08},1.7765904104379176E-3,15,{"$f":"IF(Q18=\"\",\"\",SUMIF(Data[Bygningsdel],'Unikke lister'!Q18,Data[GWP sum]))","v":611.76424239999994},2.3675075764269384E-2,11,null,"100 mm indervæg, krydsfiner",null,"100 mm indervæg, krydsfiner",{"$f":"IF(Y18=\"\",\"\",SUMIF(Data[Konstruktion],'Unikke lister'!Y18,Data[Vægt]))","v":820.03099999999995},{"$f":"IF(Y18=\"\",\"\",SUMIF(Data[Konstruktion],'Unikke lister'!Y18,Data[GWP sum]))","v":370.26416982500001},"150 mm indervæg mod bad, krydsfiner og fibergips med klinker",368.39400000000001,7.8777713970012778E-3,18,101.19594044999999,3.9162497431874136E-3,28,null,null,"Stål, valsede profiler og plader","Krinner V114x5-M24","Skruefundament","Skruefundament",112,126.20652800000001,"Vandtætningsmembran, flydende",null,"Vandtætningsmembran, flydende",36,40.055868000000004,"Vandtætningsmembran, flydende",36,7.6982733239967533E-4,31,40.055868000000004,1.5501489691244724E-3,31]
["Vinduer, døre, glasfacader",{"$f":"SUMIF(Data[Gruppe],'Unikke lister'!A19,Data[Vægt])","v":1509.3835000000001},3.2276796482585711E-2,6,{"$f":"SUMIF(Data[Gruppe],'Unikke lister'!A19,Data[GWP sum])","v":5133.581915214997},0.10977699087347717,2,null,"Punktfundament",{"$f":"SUMIF(Data[Undergruppe],'Unikke lister'!I19,Data[Vægt])","v":1442.4387199999996},3.0849471710026308E-2,6,{"$f":"SUMIF(Data[Undergruppe],'Unikke lister'!I19,Data[GWP sum])","v":1038.3970388273503},4.0356304194609657E-2,9,null,"Varmerør",{"$f":"IF(Q19=\"\",\"\",SUMIF(Data[Bygningsdel],'Unikke lister'!Q19,Data[Vægt]))","v":125.855},2.6912949699766987E-3,14,{"$f":"IF(Q19=\"\",\"\",SUMIF(Data[Bygningsdel],'Unikke lister'!Q19,Data[GWP sum]))","v":448.03147501985001},1.7338671306220032E-2,14,null,"100 mm indervæg, krydsfiner og fibergips",null,"100 mm indervæg, krydsfiner og fibergips",{"$f":"IF(Y19=\"\",\"\",SUMIF(Data[Konstruktion],'Unikke lister'!Y19,Data[Vægt]))","v":163.315},{"$f":"IF(Y19=\"\",\"\",SUMIF(Data[Konstruktion],'Unikke lister'!Y19,Data[GWP sum]))","v":36.482962525000005},"45 mm indervæg mod skakt, krydsfiner",366.96000000000004,7.8471066082606913E-3,19,195.3599999999999,7.5603679992194079E-3,20,null,null,"Stål, valsede profiler og plader","Krinner V114x5x2000","Skruefundament","Skruefundament",464,522.85561600000005,"Asfaltimprægneret porøs træfiberplade, 18 mm - Hunton Undertag","Hunton Undertag","Hunton Undertag",709.73399999999992,1240.8773249999999,"Hunton Undertag",709.73399999999992,1.5177017553704198E-2,13,1240.8773249999999,4.8021545960723722E-2,10]
["Ydervægge",{"$f":"SUMIF(Data[Gruppe],'Unikke lister'!A20,Data[Vægt])","v":16386.754699999998},0.35041587937191226,1,{"$f":"SUMIF(Data[Gruppe],'Unikke lister'!A20,Data[GWP sum])","v":4121.0747034999986},8.812544293375521E-2,3,null,"Pælefundering",{"$f":"SUMIF(Data[Undergruppe],'Unikke lister'!I20,Data[Vægt])","v":0},0,"",{"$f":"SUMIF(Data[Undergruppe],'Unikke lister'!I20,Data[GWP sum])","v":0},0,"",null,"Afkast emhætte",{"$f":"IF(Q20=\"\",\"\",SUMIF(Data[Bygningsdel],'Unikke lister'!Q20,Data[Vægt]))","v":1.5249999999999999},3.261074116415292E-5,22,{"$f":"IF(Q20=\"\",\"\",SUMIF(Data[Bygningsdel],'Unikke lister'!Q20,Data[GWP sum]))","v":4.6495068792499996},1.7993439302842041E-4,22,null,"110 mm indervæg mod bad, krydsfiner og fibergips med klinker ",null,"110 mm indervæg mod bad, krydsfiner og fibergips med klinker ",{"$f":"IF(Y20=\"\",\"\",SUMIF(Data[Konstruktion],'Unikke lister'!Y20,Data[Vægt]))","v":341.77799999999996},{"$f":"IF(Y20=\"\",\"\",SUMIF(Data[Konstruktion],'Unikke lister'!Y20,Data[GWP sum]))","v":96.508604250000005},"60 mm skunkvægge, krydsfiner",207.84,4.4444697990541253E-3,25,93.120000000000047,3.6037134934854215E-3,30,null,null,"Stål, valsede profiler og plader","Krinner V140x6,3-M24","Skruefundament","Skruefundament",30,33.805320000000002,"Dampspærre PE (tykkelse 0,0002 m)","Dampspærre","Dampspærre",67.8,444.24007499999999,"Dampspærre",67.8,1.4498414760193885E-3,28,444.24007499999999,1.7191945367530874E-2,19]
[null,null,null,null,null,null,null,null,"Ikke-bærende indervægge i kælderen",{"$f":"SUMIF(Data[Undergruppe],'Unikke lister'!I21,Data[Vægt])","v":0},0,"",{"$f":"SUMIF(Data[Undergruppe],'Unikke lister'!I21,Data[GWP sum])","v":0},0,"",null,"Indvendige døre",{"$f":"IF(Q21=\"\",\"\",SUMIF(Data[Bygningsdel],'Unikke lister'!Q21,Data[Vægt]))","v":177.43},3.7941795441020672E-3,12,{"$f":"IF(Q21=\"\",\"\",SUMIF(Data[Bygningsdel],'Unikke lister'!Q21,Data[GWP sum]))","v":107.17211763975217},4.1475258426093391E-3,17,null,"150 mm indervæg mod bad, krydsfiner og fibergips med klinker",null,"150 mm indervæg mod bad, krydsfiner og fibergips med klinker",{"$f":"IF(Y21=\"\",\"\",SUMIF(Data[Konstruktion],'Unikke lister'!Y21,Data[Vægt]))","v":368.39400000000001},{"$f":"IF(Y21=\"\",\"\",SUMIF(Data[Konstruktion],'Unikke lister'!Y21,Data[GWP sum]))","v":101.19594044999999},"80 mm indervæg, krydsfiner",59.835000000000001,1.2795171787259604E-3,33,28.849585125000019,1.11646949308869E-3,35,null,null,"Stål, valsede profiler og plader","Krinner V140x6,3x2000 ","Skruefundament","Skruefundament",144,162.265536,"Galvaniseret stålplade - Plannja","Zink-Magnesium tag","Zink-Magnesium tag",610.5,1589.2603154999999,"Zink-Magnesium tag",610.5,1.3054988511944494E-2,14,1589.2603154999999,6.1503853561299893E-2,5]
[null,null,null,null,null,null,null,null,"Bærende indervægge i kælderen",{"$f":"SUMIF(Data[Undergruppe],'Unikke lister'!I22,Data[Vægt])","v":0},0,"",{"$f":"SUMIF(Data[Undergruppe],'Unikke lister'!I22,Data[GWP sum])","v":0},0,"",null,"Udvendig dør",{"$f":"IF(Q22=\"\",\"\",SUMIF(Data[Bygningsdel],'Unikke lister'!Q22,Data[Vægt]))","v":50.841000000000001},1.0871886501814417E-3,17,{"$f":"IF(Q22=\"\",\"\",SUMIF(Data[Bygningsdel],'Unikke lister'!Q22,Data[GWP sum]))","v":10.567797575244754},4.0897030410579917E-4,21,null,"45 mm indervæg mod skakt, krydsfiner",null,"45 mm indervæg mod skakt, krydsfiner",{"$f":"IF(Y22=\"\",\"\",SUMIF(Data[Konstruktion],'Unikke lister'!Y22,Data[Vægt]))","v":366.96000000000004},{"$f":"IF(Y22=\"\",\"\",SUMIF(Data[Konstruktion],'Unikke lister'!Y22,Data[GWP sum]))","v":195.3599999999999},"Klinkebeklædning på badeværelse",317.20000000000005,6.7830341621438073E-3,21,114.71869552000001,4.4395759342833914E-3,24,null,null,"Fastgørelsesmidler/skruer i galvaniseret stål","Rem 200x185, limtræ",9,"Fastgørelsesmidler/skruer i galvaniseret stål",1.3793599999999999,4.904579413675199,"OSB2 Unsanded, Kronospan","OSB plade","OSB plade",3107.34,1349.9100000000003,"OSB plade",3107.34,6.6447646196077986E-2,4,1349.9100000000003,5.2241074763648032E-2,8]
[null,null,null,null,null,null,null,null,"Ikke-bærende indervægge",{"$f":"SUMIF(Data[Undergruppe],'Unikke lister'!I23,Data[Vægt])","v":0},0,"",{"$f":"SUMIF(Data[Undergruppe],'Unikke lister'!I23,Data[GWP sum])","v":0},0,"",null,"Facadevinduer ",{"$f":"IF(Q23=\"\",\"\",SUMIF(Data[Bygningsdel],'Unikke lister'!Q23,Data[Vægt]))","v":752.40000000000009},1.608939124715322E-2,7,{"$f":"IF(Q23=\"\",\"\",SUMIF(Data[Bygningsdel],'Unikke lister'!Q23,Data[GWP sum]))","v":2783},0.10770118827716842,3,null,"60 mm skunkvægge, krydsfiner",null,"60 mm skunkvægge, krydsfiner",{"$f":"IF(Y23=\"\",\"\",SUMIF(Data[Konstruktion],'Unikke lister'!Y23,Data[Vægt]))","v":207.84},{"$f":"IF(Y23=\"\",\"\",SUMIF(Data[Konstruktion],'Unikke lister'!Y23,Data[GWP sum]))","v":93.120000000000047},"Limtræssøjle 140 x 140 mm",52,1.1119728134661977E-3,34,13.83200000000001,5.3529386857700128E-4,38,null,null,"Limtræs-produkter af fyr og gran, Fobrænding","Rem 200x185, limtræ",9,"Limtræs-produkter af fyr og gran, Fobrænding",296,78.73599999999999,"Papirisolering kl 37 - ISOCELL","Papirisolering","Papirisolering",4965.7699999999995,1519.3573999999999,"Papirisolering",4965.7699999999995,0.10618848534473155,3,1519.3573999999999,5.8798633631947213E-2,6]
[null,null,null,null,null,null,null,null,"Bærende indervægge",{"$f":"SUMIF(Data[Undergruppe],'Unikke lister'!I24,Data[Vægt])","v":3311.9280000000003},7.0832284051307259E-2,5,{"$f":"SUMIF(Data[Undergruppe],'Unikke lister'!I24,Data[GWP sum])","v":1113.6426563877969},4.3280652895574638E-2,8,null,"Ovenlys",{"$f":"IF(Q24=\"\",\"\",SUMIF(Data[Bygningsdel],'Unikke lister'!Q24,Data[Vægt]))","v":528.71249999999998},1.1306037041148983E-2,8,{"$f":"IF(Q24=\"\",\"\",SUMIF(Data[Bygningsdel],'Unikke lister'!Q24,Data[GWP sum]))","v":2232.8420000000001},8.6410253911307688E-2,4,null,"80 mm indervæg, krydsfiner",null,"80 mm indervæg, krydsfiner",{"$f":"IF(Y24=\"\",\"\",SUMIF(Data[Konstruktion],'Unikke lister'!Y24,Data[Vægt]))","v":59.835000000000001},{"$f":"IF(Y24=\"\",\"\",SUMIF(Data[Konstruktion],'Unikke lister'!Y24,Data[GWP sum]))","v":28.849585125000019},"Tagkassette, ståltag",10885.992,0.23278706060789464,2,4973.2525832210531,0.19246324571160792,1,null,null,"Fastgørelsesmidler/skruer i galvaniseret stål","Rem 266x185, limtræ",10,"Fastgørelsesmidler/skruer i galvaniseret stål",1.3793599999999999,4.904579413675199,"Derbigum NT","Tagpap","Tagpap",132.15,154.44454500000001,"Tagpap",132.15,2.8259078326838085E-3,25,154.44454500000001,5.9769532947993578E-3,24]
[null,null,null,null,null,null,null,null,"Søjler",{"$f":"SUMIF(Data[Undergruppe],'Unikke lister'!I25,Data[Vægt])","v":52},1.112125254736207E-3,15,{"$f":"SUMIF(Data[Undergruppe],'Unikke lister'!I25,Data[GWP sum])","v":13.83200000000001},5.3756740316807854E-4,18,null,"Ydervæg, trækassette",{"$f":"IF(Q25=\"\",\"\",SUMIF(Data[Bygningsdel],'Unikke lister'!Q25,Data[Vægt]))","v":16386.754699999998},0.35041587937191226,1,{"$f":"IF(Q25=\"\",\"\",SUMIF(Data[Bygningsdel],'Unikke lister'!Q25,Data[GWP sum]))","v":4121.0747034999986},0.15948424094356067,2,null,"Klinkebeklædning på badeværelse",null,"Klinkebeklædning på badeværelse",{"$f":"IF(Y25=\"\",\"\",SUMIF(Data[Konstruktion],'Unikke lister'!Y25,Data[Vægt]))","v":317.20000000000005},{"$f":"IF(Y25=\"\",\"\",SUMIF(Data[Konstruktion],'Unikke lister'!Y25,Data[GWP sum]))","v":114.71869552000001},"Tagkassette, tagpap",1775.0700000000002,3.7958261192296998E-2,6,539.81151449999993,2.0890528766564113E-2,12,null,null,"Limtræs-produkter af fyr og gran, Fobrænding","Rem 266x185, limtræ",10,"Limtræs-produkter af fyr og gran, Fobrænding",393.67999999999989,104.71888,"Afretningslag, cementbaseret",null,"Afretningslag, cementbaseret",600,119.1339,"Afretningslag, cementbaseret",600,1.283045553999459E-2,15,119.1339,4.6104429012193155E-3,26]
[null,null,null,null,null,null,null,null,"Bjælker",{"$f":"SUMIF(Data[Undergruppe],'Unikke lister'!I26,Data[Vægt])","v":0},0,"",{"$f":"SUMIF(Data[Undergruppe],'Unikke lister'!I26,Data[GWP sum])","v":0},0,"",null,null,{"$f":"IF(Q26=\"\",\"\",SUMIF(Data[Bygningsdel],'Unikke lister'!Q26,Data[Vægt]))","v":""},"","",{"$f":"IF(Q26=\"\",\"\",SUMIF(Data[Bygningsdel],'Unikke lister'!Q26,Data[GWP sum]))","v":""},"","",null,"Limtræssøjle 140 x 140 mm",null,"Limtræssøjle 140 x 140 mm",{"$f":"IF(Y26=\"\",\"\",SUMIF(Data[Konstruktion],'Unikke lister'!Y26,Data[Vægt]))","v":52},{"$f":"IF(Y26=\"\",\"\",SUMIF(Data[Konstruktion],'Unikke lister'!Y26,Data[GWP sum]))","v":13.83200000000001},"Gulv, vådrumsgulv, keramiske fliser (Klon)",721.5,1.5428622786843493E-2,13,163.07477434999998,6.3109403433439107E-3,21,null,null,"Fermacell fiberplade 12,5 mm","100 mm indervæg, fibergips",11,"Fermacell fiberplade 12,5 mm",442.5,40.236319499999993,"Cembrit Windstopper Extreme, 9 mm","Vindspærre","Vindspærre",3067.2,1997.088,"Vindspærre",3067.2,6.5589288720452332E-2,5,1997.088,7.7286651345337312E-2,3]
[null,null,null,null,null,null,null,null,"Beklædning",{"$f":"SUMIF(Data[Undergruppe],'Unikke lister'!I27,Data[Vægt])","v":0},0,"",{"$f":"SUMIF(Data[Undergruppe],'Unikke lister'!I27,Data[GWP sum])","v":0},0,"",null,null,{"$f":"IF(Q27=\"\",\"\",SUMIF(Data[Bygningsdel],'Unikke lister'!Q27,Data[Vægt]))","v":""},"","",{"$f":"IF(Q27=\"\",\"\",SUMIF(Data[Bygningsdel],'Unikke lister'!Q27,Data[GWP sum]))","v":""},"","",null,"Tagkassette, ståltag",null,"Tagkassette, ståltag",{"$f":"IF(Y27=\"\",\"\",SUMIF(Data[Konstruktion],'Unikke lister'!Y27,Data[Vægt]))","v":10885.992},{"$f":"IF(Y27=\"\",\"\",SUMIF(Data[Konstruktion],'Unikke lister'!Y27,Data[GWP sum]))","v":4973.2525832210531},"Let trækassette, terræn",3762.08,8.0448666963171406E-2,3,1124.3318800000002,4.3511275420015358E-2,7,null,null,"Fermacell fiberplade 12,5 mm","100 mm indervæg, fibergips",11,"Fermacell fiberplade 12,5 mm",30,2.7278860677966099,"Spaandex spånplader, Spaandex spånplader (DK)","Spånplade","Spånplade",739.19999999999993,221.75999999999991,"Spånplade",739.19999999999993,1.5807121225273332E-2,12,221.75999999999991,8.5820393504652762E-3,21]
[null,null,null,null,null,null,null,null,"Andet (søjler og bjælker)",{"$f":"SUMIF(Data[Undergruppe],'Unikke lister'!I28,Data[Vægt])","v":0},0,"",{"$f":"SUMIF(Data[Undergruppe],'Unikke lister'!I28,Data[GWP sum])","v":0},0,"",null,null,{"$f":"IF(Q28=\"\",\"\",SUMIF(Data[Bygningsdel],'Unikke lister'!Q28,Data[Vægt]))","v":""},"","",{"$f":"IF(Q28=\"\",\"\",SUMIF(Data[Bygningsdel],'Unikke lister'!Q28,Data[GWP sum]))","v":""},"","",null,"Tagkassette, tagpap",null,"Tagkassette, tagpap",{"$f":"IF(Y28=\"\",\"\",SUMIF(Data[Konstruktion],'Unikke lister'!Y28,Data[Vægt]))","v":1775.0700000000002},{"$f":"IF(Y28=\"\",\"\",SUMIF(Data[Konstruktion],'Unikke lister'!Y28,Data[GWP sum]))","v":539.81151449999993},"Trægulv terrændæk",411.7,8.8038309096929532E-3,15,236.22487962,9.1418254530021784E-3,17,null,null,"Savede og tørrede konstruktionstræprodukter af fyr og gran, Fobrænding","100 mm indervæg, fibergips",11,"Savede og tørrede konstruktionstræprodukter af fyr og gran, Fobrænding",119.7,12.599999999999991,"Brugsvandsrør, rustfri stål",null,"Brugsvandsrør, rustfri stål",164.85500000000002,586.86765574984997,"Brugsvandsrør, rustfri stål",164.85500000000002,3.5252745800763469E-3,22,586.86765574984997,2.2711586017138002E-2,16]
[null,null,null,null,null,null,null,null,"Tage",{"$f":"SUMIF(Data[Undergruppe],'Unikke lister'!I29,Data[Vægt])","v":12661.062},0.2707824384996329,2,{"$f":"SUMIF(Data[Undergruppe],'Unikke lister'!I29,Data[GWP sum])","v":5513.0640977210533},0.21425994436893223,1,null,null,{"$f":"IF(Q29=\"\",\"\",SUMIF(Data[Bygningsdel],'Unikke lister'!Q29,Data[Vægt]))","v":""},"","",{"$f":"IF(Q29=\"\",\"\",SUMIF(Data[Bygningsdel],'Unikke lister'!Q29,Data[GWP sum]))","v":""},"","",null,"Gulv, vådrumsgulv, keramiske fliser (Klon)",null,"Gulv, vådrumsgulv, keramiske fliser (Klon)",{"$f":"IF(Y29=\"\",\"\",SUMIF(Data[Konstruktion],'Unikke lister'!Y29,Data[Vægt]))","v":721.5},{"$f":"IF(Y29=\"\",\"\",SUMIF(Data[Konstruktion],'Unikke lister'!Y29,Data[GWP sum]))","v":163.07477434999998},"Trætrappe pr. etage",274.3,5.8656565910341933E-3,24,71.292105263157893,2.7589811180823132E-3,33,null,null,"Træfiberisolering (bats), kl. 38 - Hunton","100 mm indervæg, fibergips",11,"Træfiberisolering (bats), kl. 38 - Hunton",74.374999999999986,21.57849312499998,"Varmepumpe",null,"Varmepumpe",303.08,2689.3364424000001,"Varmepumpe",303.08,6.4810907751025994E-3,18,2689.3364424000001,0.10407643928263484,2]
[null,null,null,null,null,null,null,null,"Terrændæk",{"$f":"SUMIF(Data[Undergruppe],'Unikke lister'!I30,Data[Vægt])","v":4895.28},0.10469547148086653,4,{"$f":"SUMIF(Data[Undergruppe],'Unikke lister'!I30,Data[GWP sum])","v":1523.63153397},5.9214477089448263E-2,6,null,null,{"$f":"IF(Q30=\"\",\"\",SUMIF(Data[Bygningsdel],'Unikke lister'!Q30,Data[Vægt]))","v":""},"","",{"$f":"IF(Q30=\"\",\"\",SUMIF(Data[Bygningsdel],'Unikke lister'!Q30,Data[GWP sum]))","v":""},"","",null,"Let trækassette, terræn",null,"Let trækassette, terræn",{"$f":"IF(Y30=\"\",\"\",SUMIF(Data[Konstruktion],'Unikke lister'!Y30,Data[Vægt]))","v":3762.08},{"$f":"IF(Y30=\"\",\"\",SUMIF(Data[Konstruktion],'Unikke lister'!Y30,Data[GWP sum]))","v":1124.3318800000002},"Rustfrit stålrør",39,8.3397961009964831E-4,36,138.83618073,5.3729147109179707E-3,23,null,null,"Savede og tørrede konstruktionstræprodukter af fyr og gran, Fobrænding","100 mm indervæg, krydsfiner",12,"Savede og tørrede konstruktionstræprodukter af fyr og gran, Fobrænding",177.15600000000001,18.648000000000021,"Magna3 25-(40/60/80/100/120)","Pumpe","Pumpe",6.41,109.2852,"Pumpe",6.41,1.3707203335227552E-4,34,109.2852,4.2293014376960144E-3,27]
[null,null,null,null,null,null,null,null,"Trapper og ramper",{"$f":"SUMIF(Data[Undergruppe],'Unikke lister'!I31,Data[Vægt])","v":274.3},5.8664607187334924E-3,8,{"$f":"SUMIF(Data[Undergruppe],'Unikke lister'!I31,Data[GWP sum])","v":71.292105263157893},2.7706992403630035E-3,16,null,null,{"$f":"IF(Q31=\"\",\"\",SUMIF(Data[Bygningsdel],'Unikke lister'!Q31,Data[Vægt]))","v":""},"","",{"$f":"IF(Q31=\"\",\"\",SUMIF(Data[Bygningsdel],'Unikke lister'!Q31,Data[GWP sum]))","v":""},"","",null,"Trægulv terrændæk",null,"Trægulv terrændæk",{"$f":"IF(Y31=\"\",\"\",SUMIF(Data[Konstruktion],'Unikke lister'!Y31,Data[Vægt]))","v":411.7},{"$f":"IF(Y31=\"\",\"\",SUMIF(Data[Konstruktion],'Unikke lister'!Y31,Data[GWP sum]))","v":236.22487962},"Varmepumpe",303.08,6.4810907751025994E-3,22,2689.3364424000001,0.10407643928263483,4,null,null,"Træfiberisolering (bats), kl. 38 - Hunton","100 mm indervæg, krydsfiner",12,"Træfiberisolering (bats), kl. 38 - Hunton",110.075,31.936169824999979,"Radiator",null,"Radiator",141.33250285429801,590.63822412525394,"Radiator",141.33250285429801,3.022267323713715E-3,23,590.63822412525394,2.2857505778011634E-2,15]
[null,null,null,null,null,null,null,null,"Sekundær bebyggelse",{"$f":"SUMIF(Data[Undergruppe],'Unikke lister'!I32,Data[Vægt])","v":0},0,"",{"$f":"SUMIF(Data[Undergruppe],'Unikke lister'!I32,Data[GWP sum])","v":0},0,"",null,null,{"$f":"IF(Q32=\"\",\"\",SUMIF(Data[Bygningsdel],'Unikke lister'!Q32,Data[Vægt]))","v":""},"","",{"$f":"IF(Q32=\"\",\"\",SUMIF(Data[Bygningsdel],'Unikke lister'!Q32,Data[GWP sum]))","v":""},"","",null,"Trætrappe pr. etage",null,"Trætrappe pr. etage",{"$f":"IF(Y32=\"\",\"\",SUMIF(Data[Konstruktion],'Unikke lister'!Y32,Data[Vægt]))","v":274.3},{"$f":"IF(Y32=\"\",\"\",SUMIF(Data[Konstruktion],'Unikke lister'!Y32,Data[GWP sum]))","v":71.292105263157893},"Magna3 25-40",6.41,1.3707203335227552E-4,40,109.2852,4.2293014376960135E-3,26,null,null,"WISA Gran krydsfiner, ubehandlet, Fobrænding","100 mm indervæg, krydsfiner",12,"WISA Gran krydsfiner, ubehandlet, Fobrænding",266.39999999999998,159.84,"Ventilationskanal, galvaniseret stål","Ventilationskanal","Ventilationskanal",1.5249999999999999,4.6495068792499996,"Ventilationskanal",1.5249999999999999,3.2610741164152913E-5,35,4.6495068792499996,1.7993439302842044E-4,35]
[null,null,null,null,null,null,null,null,"Belægninger",{"$f":"SUMIF(Data[Undergruppe],'Unikke lister'!I33,Data[Vægt])","v":0},0,"",{"$f":"SUMIF(Data[Undergruppe],'Unikke lister'!I33,Data[GWP sum])","v":0},0,"",null,null,{"$f":"IF(Q33=\"\",\"\",SUMIF(Data[Bygningsdel],'Unikke lister'!Q33,Data[Vægt]))","v":""},"","",{"$f":"IF(Q33=\"\",\"\",SUMIF(Data[Bygningsdel],'Unikke lister'!Q33,Data[GWP sum]))","v":""},"","",null,"Rustfrit stålrør",null,"Rustfrit stålrør",{"$f":"IF(Y33=\"\",\"\",SUMIF(Data[Konstruktion],'Unikke lister'!Y33,Data[Vægt]))","v":39},{"$f":"IF(Y33=\"\",\"\",SUMIF(Data[Konstruktion],'Unikke lister'!Y33,Data[GWP sum]))","v":138.83618073},"Radiator",141.33250285429801,3.022267323713715E-3,29,590.63822412525394,2.2857505778011631E-2,11,null,null,"WISA Gran krydsfiner, ubehandlet, Fobrænding","100 mm indervæg, krydsfiner",12,"WISA Gran krydsfiner, ubehandlet, Fobrænding",266.39999999999998,159.84,"Indvendig dør",null,"Indvendig dør",177.43,107.17211763975217,"Indvendig dør",177.43,3.7941795441020667E-3,21,107.17211763975217,4.1475258426093399E-3,28]
[null,null,null,null,null,null,null,null,"Terrænbefæstninger",{"$f":"SUMIF(Data[Undergruppe],'Unikke lister'!I34,Data[Vægt])","v":0},0,"",{"$f":"SUMIF(Data[Undergruppe],'Unikke lister'!I34,Data[GWP sum])","v":0},0,"",null,null,{"$f":"IF(Q34=\"\",\"\",SUMIF(Data[Bygningsdel],'Unikke lister'!Q34,Data[Vægt]))","v":""},"","",{"$f":"IF(Q34=\"\",\"\",SUMIF(Data[Bygningsdel],'Unikke lister'!Q34,Data[GWP sum]))","v":""},"","",null,"Metroair 330, indedel til VP","Varmepumpe","Varmepumpe",{"$f":"IF(Y34=\"\",\"\",SUMIF(Data[Konstruktion],'Unikke lister'!Y34,Data[Vægt]))","v":220},{"$f":"IF(Y34=\"\",\"\",SUMIF(Data[Konstruktion],'Unikke lister'!Y34,Data[GWP sum]))","v":2077.5722000000001},"Press rør",125.855,2.6912949699766982E-3,31,448.03147501985001,1.7338671306220032E-2,14,null,null,"Fermacell fiberplade 12,5 mm","100 mm indervæg, krydsfiner og fibergips",13,"Fermacell fiberplade 12,5 mm",88.5,8.0472639000000008,"Udvendig dør",null,"Udvendig dør",50.841000000000001,10.567797575244754,"Udvendig dør",50.841000000000001,1.0871886501814415E-3,29,10.567797575244754,4.0897030410579923E-4,34]
[null,null,null,null,null,null,null,null,"Udendørs belysning",{"$f":"SUMIF(Data[Undergruppe],'Unikke lister'!I35,Data[Vægt])","v":0},0,"",{"$f":"SUMIF(Data[Undergruppe],'Unikke lister'!I35,Data[GWP sum])","v":0},0,"",null,null,{"$f":"IF(Q35=\"\",\"\",SUMIF(Data[Bygningsdel],'Unikke lister'!Q35,Data[Vægt]))","v":""},"","",{"$f":"IF(Q35=\"\",\"\",SUMIF(Data[Bygningsdel],'Unikke lister'!Q35,Data[GWP sum]))","v":""},"","",null,"Magna3 25-40",null,"Magna3 25-40",{"$f":"IF(Y35=\"\",\"\",SUMIF(Data[Konstruktion],'Unikke lister'!Y35,Data[Vægt]))","v":6.41},{"$f":"IF(Y35=\"\",\"\",SUMIF(Data[Konstruktion],'Unikke lister'!Y35,Data[GWP sum]))","v":109.2852},"Ventilationskanaler Ø125, enfamiliehuse og etageboliger, central",1.5249999999999999,3.2610741164152913E-5,41,4.6495068792499996,1.7993439302842041E-4,41,null,null,"Savede og tørrede konstruktionstræprodukter af fyr og gran, Fobrænding","100 mm indervæg, krydsfiner og fibergips",13,"Savede og tørrede konstruktionstræprodukter af fyr og gran, Fobrænding",23.94,2.519999999999996,"Facadevindue",null,"Facadevindue",752.40000000000009,2783,"Facadevindue",752.40000000000009,1.6089391247153216E-2,9,2783,0.10770118827716843,1]
[null,null,null,null,null,null,null,null,"Installationer over jord",{"$f":"SUMIF(Data[Undergruppe],'Unikke lister'!I36,Data[Vægt])","v":0},0,"",{"$f":"SUMIF(Data[Undergruppe],'Unikke lister'!I36,Data[GWP sum])","v":0},0,"",null,null,{"$f":"IF(Q36=\"\",\"\",SUMIF(Data[Bygningsdel],'Unikke lister'!Q36,Data[Vægt]))","v":""},"","",{"$f":"IF(Q36=\"\",\"\",SUMIF(Data[Bygningsdel],'Unikke lister'!Q36,Data[GWP sum]))","v":""},"","",null,"Radiator, 142/2000","Radiator","Radiator",{"$f":"IF(Y36=\"\",\"\",SUMIF(Data[Konstruktion],'Unikke lister'!Y36,Data[Vægt]))","v":16.158788562893999},{"$f":"IF(Y36=\"\",\"\",SUMIF(Data[Konstruktion],'Unikke lister'!Y36,Data[GWP sum]))","v":67.528685815762003},"Indvendig dør",177.43,3.7941795441020667E-3,27,107.17211763975217,4.1475258426093391E-3,27,null,null,"Træfiberisolering (bats), kl. 38 - Hunton","100 mm indervæg, krydsfiner og fibergips",13,"Træfiberisolering (bats), kl. 38 - Hunton",14.875,4.3156986249999987,"Velux ovenlys",null,"Velux ovenlys",394.3125,1431.8820000000001,"Velux ovenlys",394.3125,8.4320150001901944E-3,17,1431.8820000000001,5.5413364309266439E-2,7]
[null,null,null,null,null,null,null,null,"Installationer under jord",{"$f":"SUMIF(Data[Undergruppe],'Unikke lister'!I37,Data[Vægt])","v":0},0,"",{"$f":"SUMIF(Data[Undergruppe],'Unikke lister'!I37,Data[GWP sum])","v":0},0,"",null,null,{"$f":"IF(Q37=\"\",\"\",SUMIF(Data[Bygningsdel],'Unikke lister'!Q37,Data[Vægt]))","v":""},"","",{"$f":"IF(Q37=\"\",\"\",SUMIF(Data[Bygningsdel],'Unikke lister'!Q37,Data[GWP sum]))","v":""},"","",null,"Radiator, 200/1000","Radiator","Radiator",{"$f":"IF(Y37=\"\",\"\",SUMIF(Data[Konstruktion],'Unikke lister'!Y37,Data[Vægt]))","v":22.758857125788001},{"$f":"IF(Y37=\"\",\"\",SUMIF(Data[Konstruktion],'Unikke lister'!Y37,Data[GWP sum]))","v":95.110825071524019},"Udvendig dør",50.841000000000001,1.0871886501814415E-3,35,10.567797575244754,4.0897030410579917E-4,39,null,null,"WISA Gran krydsfiner, ubehandlet, Fobrænding","100 mm indervæg, krydsfiner og fibergips",13,"WISA Gran krydsfiner, ubehandlet, Fobrænding",36,21.600000000000009,"Velux fladt ovenlys",null,"Velux fladt ovenlys",134.4,800.96,"Velux fladt ovenlys",134.4,2.874022040958788E-3,24,800.96,3.0996889602041264E-2,14]
[null,null,null,null,null,null,null,null,"Udendørs trapper og ramper",{"$f":"SUMIF(Data[Undergruppe],'Unikke lister'!I38,Data[Vægt])","v":0},0,"",{"$f":"SUMIF(Data[Undergruppe],'Unikke lister'!I38,Data[GWP sum])","v":0},0,"",null,null,{"$f":"IF(Q38=\"\",\"\",SUMIF(Data[Bygningsdel],'Unikke lister'!Q38,Data[Vægt]))","v":""},"","",{"$f":"IF(Q38=\"\",\"\",SUMIF(Data[Bygningsdel],'Unikke lister'!Q38,Data[GWP sum]))","v":""},"","",null,"Radiator, 200/1100","Radiator","Radiator",{"$f":"IF(Y38=\"\",\"\",SUMIF(Data[Konstruktion],'Unikke lister'!Y38,Data[Vægt]))","v":12.517371437106},{"$f":"IF(Y38=\"\",\"\",SUMIF(Data[Konstruktion],'Unikke lister'!Y38,Data[GWP sum]))","v":52.31095386423798},"Facadevindue",752.40000000000009,1.6089391247153216E-2,10,2783,0.10770118827716842,3,null,null,"Fermacell fiberplade 12,5 mm","110 mm indervæg mod bad, krydsfiner og fibergips med klinker ",14,"Fermacell fiberplade 12,5 mm",106.2,9.6567166799999988,"Træbeklædning 19 mm, ubehandlet gran - InnTre Kjeldstad AS","Træbeklædning","Træbeklædning",1495.4406999999999,416.54442440000008,"Træbeklædning",1495.4406999999999,3.1978642356747307E-2,7,416.54442440000008,1.612013276252575E-2,20]
[null,null,null,null,null,null,null,null,"Udendørs inventar",{"$f":"SUMIF(Data[Undergruppe],'Unikke lister'!I39,Data[Vægt])","v":0},0,"",{"$f":"SUMIF(Data[Undergruppe],'Unikke lister'!I39,Data[GWP sum])","v":0},0,"",null,null,{"$f":"IF(Q39=\"\",\"\",SUMIF(Data[Bygningsdel],'Unikke lister'!Q39,Data[Vægt]))","v":""},"","",{"$f":"IF(Q39=\"\",\"\",SUMIF(Data[Bygningsdel],'Unikke lister'!Q39,Data[GWP sum]))","v":""},"","",null,"Radiator, 200/2000","Radiator","Radiator",{"$f":"IF(Y39=\"\",\"\",SUMIF(Data[Konstruktion],'Unikke lister'!Y39,Data[Vægt]))","v":45.517714291403998},{"$f":"IF(Y39=\"\",\"\",SUMIF(Data[Konstruktion],'Unikke lister'!Y39,Data[GWP sum]))","v":190.22165030949199},"Velux ovenlys",394.3125,8.4320150001901944E-3,17,1431.8820000000001,5.5413364309266432E-2,6,null,null,"Keramikfliser, glaseret","110 mm indervæg mod bad, krydsfiner og fibergips med klinker ",14,"Keramikfliser, glaseret",120,37.958604000000001,"",null,"","","","","","","","","",""]
[null,null,null,null,null,null,null,null,"Andet (udendørs areal)",{"$f":"SUMIF(Data[Undergruppe],'Unikke lister'!I40,Data[Vægt])","v":0},0,"",{"$f":"SUMIF(Data[Undergruppe],'Unikke lister'!I40,Data[GWP sum])","v":0},0,"",null,null,{"$f":"IF(Q40=\"\",\"\",SUMIF(Data[Bygningsdel],'Unikke lister'!Q40,Data[Vægt]))","v":""},"","",{"$f":"IF(Q40=\"\",\"\",SUMIF(Data[Bygningsdel],'Unikke lister'!Q40,Data[GWP sum]))","v":""},"","",null,"Radiator, 200/600","Radiator","Radiator",{"$f":"IF(Y40=\"\",\"\",SUMIF(Data[Konstruktion],'Unikke lister'!Y40,Data[Vægt]))","v":6.8276571457020001},{"$f":"IF(Y40=\"\",\"\",SUMIF(Data[Konstruktion],'Unikke lister'!Y40,Data[GWP sum]))","v":28.533247554745991},"Velux fladt ovenlys",134.4,2.874022040958788E-3,30,800.96,3.0996889602041257E-2,10,null,null,"Mørtel, fliseklæber","110 mm indervæg mod bad, krydsfiner og fibergips med klinker ",14,"Mørtel, fliseklæber",18.600000000000001,6.7592716200000007,null,null,"","","",null,"","","","","",""]
[null,null,null,null,null,null,null,null,"Varmtvandsbeholder",{"$f":"SUMIF(Data[Undergruppe],'Unikke lister'!I41,Data[Vægt])","v":220},4.705145308499338E-3,10,{"$f":"SUMIF(Data[Undergruppe],'Unikke lister'!I41,Data[GWP sum])","v":2077.5722000000001},8.074284936727813E-2,4,null,null,{"$f":"IF(Q41=\"\",\"\",SUMIF(Data[Bygningsdel],'Unikke lister'!Q41,Data[Vægt]))","v":""},"","",{"$f":"IF(Q41=\"\",\"\",SUMIF(Data[Bygningsdel],'Unikke lister'!Q41,Data[GWP sum]))","v":""},"","",null,"Radiator, 300/400","Radiator","Radiator",{"$f":"IF(Y41=\"\",\"\",SUMIF(Data[Konstruktion],'Unikke lister'!Y41,Data[Vægt]))","v":6.8276571457020001},{"$f":"IF(Y41=\"\",\"\",SUMIF(Data[Konstruktion],'Unikke lister'!Y41,Data[GWP sum]))","v":28.533247554745991},"Facadekassette uden beklædning",13726.407999999999,0.29352677927971005,1,3463.4924923999993,0.13403602480076596,2,null,null,"Savede og tørrede konstruktionstræprodukter af fyr og gran, Fobrænding","110 mm indervæg mod bad, krydsfiner og fibergips med klinker ",14,"Savede og tørrede konstruktionstræprodukter af fyr og gran, Fobrænding",28.728000000000002,3.0239999999999938,null,null,"","","",null,"","","","","",""]
[null,null,null,null,null,null,null,null,"Vandrør",{"$f":"SUMIF(Data[Undergruppe],'Unikke lister'!I42,Data[Vægt])","v":39},8.3409394105215531E-4,16,{"$f":"SUMIF(Data[Undergruppe],'Unikke lister'!I42,Data[GWP sum])","v":138.83618073},5.3957349002891897E-3,14,null,null,{"$f":"IF(Q42=\"\",\"\",SUMIF(Data[Bygningsdel],'Unikke lister'!Q42,Data[Vægt]))","v":""},"","",{"$f":"IF(Q42=\"\",\"\",SUMIF(Data[Bygningsdel],'Unikke lister'!Q42,Data[GWP sum]))","v":""},"","",null,"Radiator, 600/900","Radiator","Radiator",{"$f":"IF(Y42=\"\",\"\",SUMIF(Data[Konstruktion],'Unikke lister'!Y42,Data[Vægt]))","v":30.724457145702001},{"$f":"IF(Y42=\"\",\"\",SUMIF(Data[Konstruktion],'Unikke lister'!Y42,Data[GWP sum]))","v":128.399613954746},"Tilbagetrukket facadekassette uden beklædning",735.35399999999993,1.5724878005261966E-2,12,195.82178669999999,7.5782389932260918E-3,19,null,null,"Træfiberisolering (bats), kl. 38 - Hunton","110 mm indervæg mod bad, krydsfiner og fibergips med klinker ",14,"Træfiberisolering (bats), kl. 38 - Hunton",17.850000000000001,5.1788383499999968,null,null,"","","",null,"","","","","",""]
[null,null,null,null,null,null,null,null,"Varmeforsyningsanlæg",{"$f":"SUMIF(Data[Undergruppe],'Unikke lister'!I43,Data[Vægt])","v":83.08},1.7768339646823863E-3,14,{"$f":"SUMIF(Data[Undergruppe],'Unikke lister'!I43,Data[GWP sum])","v":611.76424239999994},2.3775630070709562E-2,10,null,null,{"$f":"IF(Q43=\"\",\"\",SUMIF(Data[Bygningsdel],'Unikke lister'!Q43,Data[Vægt]))","v":""},"","",{"$f":"IF(Q43=\"\",\"\",SUMIF(Data[Bygningsdel],'Unikke lister'!Q43,Data[GWP sum]))","v":""},"","",null,"Varmepumpe luft til vand ","Varmepumpe","Varmepumpe",{"$f":"IF(Y43=\"\",\"\",SUMIF(Data[Konstruktion],'Unikke lister'!Y43,Data[Vægt]))","v":83.08},{"$f":"IF(Y43=\"\",\"\",SUMIF(Data[Konstruktion],'Unikke lister'!Y43,Data[GWP sum]))","v":611.76424239999994},"Træbeklædning med ophæng",1814.6428000000001,3.8804489610618824E-2,5,435.29008160000012,1.6845583555007409E-2,15,null,null,"Vandtætningsmembran, flydende","110 mm indervæg mod bad, krydsfiner og fibergips med klinker ",14,"Vandtætningsmembran, flydende",7.1999999999999993,8.0111735999999993,null,null,"","","",null,"","","","","",""]
[null,null,null,null,null,null,null,null,"Varmerør",{"$f":"SUMIF(Data[Undergruppe],'Unikke lister'!I44,Data[Vægt])","v":125.855},2.6916639218235645E-3,13,{"$f":"SUMIF(Data[Undergruppe],'Unikke lister'!I44,Data[GWP sum])","v":448.03147501985001},1.7412313227587076E-2,13,null,null,{"$f":"IF(Q44=\"\",\"\",SUMIF(Data[Bygningsdel],'Unikke lister'!Q44,Data[Vægt]))","v":""},"","",{"$f":"IF(Q44=\"\",\"\",SUMIF(Data[Bygningsdel],'Unikke lister'!Q44,Data[GWP sum]))","v":""},"","",null,"Press rør",null,"Press rør",{"$f":"IF(Y44=\"\",\"\",SUMIF(Data[Konstruktion],'Unikke lister'!Y44,Data[Vægt]))","v":125.855},{"$f":"IF(Y44=\"\",\"\",SUMIF(Data[Konstruktion],'Unikke lister'!Y44,Data[GWP sum]))","v":448.03147501985001},"Træbeklædning tilbagetrukket med ophæng",110.34989999999999,2.3597324763214148E-3,32,26.470342800000001,1.0243935945612611E-3,37,null,null,"WISA Gran krydsfiner, ubehandlet, Fobrænding","110 mm indervæg mod bad, krydsfiner og fibergips med klinker ",14,"WISA Gran krydsfiner, ubehandlet, Fobrænding",43.2,25.920000000000019,null,null,"","","",null,"","","","","",""]
[null,null,null,null,null,null,null,null,"Radiatorer",{"$f":"SUMIF(Data[Undergruppe],'Unikke lister'!I45,Data[Vægt])","v":141.33250285429801},3.0226816488334979E-3,12,{"$f":"SUMIF(Data[Undergruppe],'Unikke lister'!I45,Data[GWP sum])","v":590.63822412525394},2.2954587648555385E-2,11,null,null,{"$f":"IF(Q45=\"\",\"\",SUMIF(Data[Bygningsdel],'Unikke lister'!Q45,Data[Vægt]))","v":""},"","",{"$f":"IF(Q45=\"\",\"\",SUMIF(Data[Bygningsdel],'Unikke lister'!Q45,Data[GWP sum]))","v":""},"","",null,"Ventilationskanaler Ø125, enfamiliehuse og etageboliger, central",null,"Ventilationskanaler Ø125, enfamiliehuse og etageboliger, central",{"$f":"IF(Y45=\"\",\"\",SUMIF(Data[Konstruktion],'Unikke lister'!Y45,Data[Vægt]))","v":1.5249999999999999},{"$f":"IF(Y45=\"\",\"\",SUMIF(Data[Konstruktion],'Unikke lister'!Y45,Data[GWP sum]))","v":4.6495068792499996},"","","","","","","",null,null,"Fermacell fiberplade 12,5 mm","150 mm indervæg mod bad, krydsfiner og fibergips med klinker",15,"Fermacell fiberplade 12,5 mm",106.2,9.6567166799999988,null,null,"","","",null,"","","","","",""]
[null,null,null,null,null,null,null,null,"Gulvvarme",{"$f":"SUMIF(Data[Undergruppe],'Unikke lister'!I46,Data[Vægt])","v":0},0,"",{"$f":"SUMIF(Data[Undergruppe],'Unikke lister'!I46,Data[GWP sum])","v":0},0,"",null,null,{"$f":"IF(Q46=\"\",\"\",SUMIF(Data[Bygningsdel],'Unikke lister'!Q46,Data[Vægt]))","v":""},"","",{"$f":"IF(Q46=\"\",\"\",SUMIF(Data[Bygningsdel],'Unikke lister'!Q46,Data[GWP sum]))","v":""},"","",null,"Dør, indvendig","Indvendig dør","Indvendig dør",{"$f":"IF(Y46=\"\",\"\",SUMIF(Data[Konstruktion],'Unikke lister'!Y46,Data[Vægt]))","v":177.43},{"$f":"IF(Y46=\"\",\"\",SUMIF(Data[Konstruktion],'Unikke lister'!Y46,Data[GWP sum]))","v":107.17211763975217},null,"","","","","","",null,null,"Keramikfliser, glaseret","150 mm indervæg mod bad, krydsfiner og fibergips med klinker",15,"Keramikfliser, glaseret",120,37.958604000000001,null,null,"","","",null,"","","","","",""]
[null,null,null,null,null,null,null,null,"Andet (varme)",{"$f":"SUMIF(Data[Undergruppe],'Unikke lister'!I47,Data[Vægt])","v":0},0,"",{"$f":"SUMIF(Data[Undergruppe],'Unikke lister'!I47,Data[GWP sum])","v":0},0,"",null,null,{"$f":"IF(Q47=\"\",\"\",SUMIF(Data[Bygningsdel],'Unikke lister'!Q47,Data[Vægt]))","v":""},"","",{"$f":"IF(Q47=\"\",\"\",SUMIF(Data[Bygningsdel],'Unikke lister'!Q47,Data[GWP sum]))","v":""},"","",null,"Udvendig dør, træ","Udvendig dør","Udvendig dør",{"$f":"IF(Y47=\"\",\"\",SUMIF(Data[Konstruktion],'Unikke lister'!Y47,Data[Vægt]))","v":50.841000000000001},{"$f":"IF(Y47=\"\",\"\",SUMIF(Data[Konstruktion],'Unikke lister'!Y47,Data[GWP sum]))","v":10.567797575244754},null,"","","","","","",null,null,"Mørtel, fliseklæber","150 mm indervæg mod bad, krydsfiner og fibergips med klinker",15,"Mørtel, fliseklæber",18.600000000000001,6.7592716200000007,null,null,"","","",null,"","","","","",""]
[null,null,null,null,null,null,null,null,"Ventilationsanlæg",{"$f":"SUMIF(Data[Undergruppe],'Unikke lister'!I48,Data[Vægt])","v":0},0,"",{"$f":"SUMIF(Data[Undergruppe],'Unikke lister'!I48,Data[GWP sum])","v":0},0,"",null,null,{"$f":"IF(Q48=\"\",\"\",SUMIF(Data[Bygningsdel],'Unikke lister'!Q48,Data[Vægt]))","v":""},"","",{"$f":"IF(Q48=\"\",\"\",SUMIF(Data[Bygningsdel],'Unikke lister'!Q48,Data[GWP sum]))","v":""},"","",null,"Facadevinduer","Facadevindue","Facadevindue",{"$f":"IF(Y48=\"\",\"\",SUMIF(Data[Konstruktion],'Unikke lister'!Y48,Data[Vægt]))","v":752.40000000000009},{"$f":"IF(Y48=\"\",\"\",SUMIF(Data[Konstruktion],'Unikke lister'!Y48,Data[GWP sum]))","v":2783},null,"","","","","","",null,null,"Savede og tørrede konstruktionstræprodukter af fyr og gran, Fobrænding","150 mm indervæg mod bad, krydsfiner og fibergips med klinker",15,"Savede og tørrede konstruktionstræprodukter af fyr og gran, Fobrænding",45.144000000000013,4.7519999999999953,null,null,"","","",null,"","","","","",""]
[null,null,null,null,null,null,null,null,"Ventilationskanaler",{"$f":"SUMIF(Data[Undergruppe],'Unikke lister'!I49,Data[Vægt])","v":1.5249999999999999},3.2615211797552226E-5,19,{"$f":"SUMIF(Data[Undergruppe],'Unikke lister'!I49,Data[GWP sum])","v":4.6495068792499996},1.8069862197010825E-4,19,null,null,{"$f":"IF(Q49=\"\",\"\",SUMIF(Data[Bygningsdel],'Unikke lister'!Q49,Data[Vægt]))","v":""},"","",{"$f":"IF(Q49=\"\",\"\",SUMIF(Data[Bygningsdel],'Unikke lister'!Q49,Data[GWP sum]))","v":""},"","",null,"Velux GGL ovenlys m. aluinddækning, 3-lagsrude (træ)","Velux ovenlys","Velux ovenlys",{"$f":"IF(Y49=\"\",\"\",SUMIF(Data[Konstruktion],'Unikke lister'!Y49,Data[Vægt]))","v":394.3125},{"$f":"IF(Y49=\"\",\"\",SUMIF(Data[Konstruktion],'Unikke lister'!Y49,Data[GWP sum]))","v":1431.8820000000001},null,"","","","","","",null,null,"Træfiberisolering (bats), kl. 38 - Hunton","150 mm indervæg mod bad, krydsfiner og fibergips med klinker",15,"Træfiberisolering (bats), kl. 38 - Hunton",28.05,8.138174549999988,null,null,"","","",null,"","","","","",""]
[null,null,null,null,null,null,null,null,"Vinduer",{"$f":"SUMIF(Data[Undergruppe],'Unikke lister'!I50,Data[Vægt])","v":1281.1125000000002},2.7399183950158449E-2,7,{"$f":"SUMIF(Data[Undergruppe],'Unikke lister'!I50,Data[GWP sum])","v":5015.8419999999996},0.1949358848063461,2,null,null,{"$f":"IF(Q50=\"\",\"\",SUMIF(Data[Bygningsdel],'Unikke lister'!Q50,Data[Vægt]))","v":""},"","",{"$f":"IF(Q50=\"\",\"\",SUMIF(Data[Bygningsdel],'Unikke lister'!Q50,Data[GWP sum]))","v":""},"","",null,"Velux modular skylight, 3-lagsrude","Velux fladt ovenlys","Velux fladt ovenlys",{"$f":"IF(Y50=\"\",\"\",SUMIF(Data[Konstruktion],'Unikke lister'!Y50,Data[Vægt]))","v":134.4},{"$f":"IF(Y50=\"\",\"\",SUMIF(Data[Konstruktion],'Unikke lister'!Y50,Data[GWP sum]))","v":800.96},null,"","","","","","",null,null,"Vandtætningsmembran, flydende","150 mm indervæg mod bad, krydsfiner og fibergips med klinker",15,"Vandtætningsmembran, flydende",7.1999999999999993,8.0111735999999993,null,null,"","","",null,"","","","","",""]
[null,null,null,null,null,null,null,null,"Døre",{"$f":"SUMIF(Data[Undergruppe],'Unikke lister'!I51,Data[Vægt])","v":228.27100000000002},4.8820373850747834E-3,9,{"$f":"SUMIF(Data[Undergruppe],'Unikke lister'!I51,Data[GWP sum])","v":117.73991521499693},4.5758487905838341E-3,15,null,null,{"$f":"IF(Q51=\"\",\"\",SUMIF(Data[Bygningsdel],'Unikke lister'!Q51,Data[Vægt]))","v":""},"","",{"$f":"IF(Q51=\"\",\"\",SUMIF(Data[Bygningsdel],'Unikke lister'!Q51,Data[GWP sum]))","v":""},"","",null,"Facadekassette uden beklædning",null,"Facadekassette uden beklædning",{"$f":"IF(Y51=\"\",\"\",SUMIF(Data[Konstruktion],'Unikke lister'!Y51,Data[Vægt]))","v":13726.407999999999},{"$f":"IF(Y51=\"\",\"\",SUMIF(Data[Konstruktion],'Unikke lister'!Y51,Data[GWP sum]))","v":3463.4924923999993},null,"","","","","","",null,null,"WISA Gran krydsfiner, ubehandlet, Fobrænding","150 mm indervæg mod bad, krydsfiner og fibergips med klinker",15,"WISA Gran krydsfiner, ubehandlet, Fobrænding",43.2,25.920000000000019,null,null,"","","",null,"","","","","",""]
[null,null,null,null,null,null,null,null,"Glasfacader",{"$f":"SUMIF(Data[Undergruppe],'Unikke lister'!I52,Data[Vægt])","v":0},0,"",{"$f":"SUMIF(Data[Undergruppe],'Unikke lister'!I52,Data[GWP sum])","v":0},0,"",null,null,{"$f":"IF(Q52=\"\",\"\",SUMIF(Data[Bygningsdel],'Unikke lister'!Q52,Data[Vægt]))","v":""},"","",{"$f":"IF(Q52=\"\",\"\",SUMIF(Data[Bygningsdel],'Unikke lister'!Q52,Data[GWP sum]))","v":""},"","",null,"Tilbagetrukket facadekassette uden beklædning",null,"Tilbagetrukket facadekassette uden beklædning",{"$f":"IF(Y52=\"\",\"\",SUMIF(Data[Konstruktion],'Unikke lister'!Y52,Data[Vægt]))","v":735.35399999999993},{"$f":"IF(Y52=\"\",\"\",SUMIF(Data[Konstruktion],'Unikke lister'!Y52,Data[GWP sum]))","v":195.82178669999999},null,"","","","","","",null,null,"Savede og tørrede konstruktionstræprodukter af fyr og gran, Fobrænding","45 mm indervæg mod skakt, krydsfiner",16,"Savede og tørrede konstruktionstræprodukter af fyr og gran, Fobrænding",50.16,5.2800000000000011,null,null,"","","",null,"","","","","",""]
[null,null,null,null,null,null,null,null,"Kælderydervægge",{"$f":"SUMIF(Data[Undergruppe],'Unikke lister'!I53,Data[Vægt])","v":0},0,"",{"$f":"SUMIF(Data[Undergruppe],'Unikke lister'!I53,Data[GWP sum])","v":0},0,"",null,null,{"$f":"IF(Q53=\"\",\"\",SUMIF(Data[Bygningsdel],'Unikke lister'!Q53,Data[Vægt]))","v":""},"","",{"$f":"IF(Q53=\"\",\"\",SUMIF(Data[Bygningsdel],'Unikke lister'!Q53,Data[GWP sum]))","v":""},"","",null,"Træbeklædning med ophæng",null,"Træbeklædning med ophæng",{"$f":"IF(Y53=\"\",\"\",SUMIF(Data[Konstruktion],'Unikke lister'!Y53,Data[Vægt]))","v":1814.6428000000001},{"$f":"IF(Y53=\"\",\"\",SUMIF(Data[Konstruktion],'Unikke lister'!Y53,Data[GWP sum]))","v":435.29008160000012},null,"","","","","","",null,null,"WISA Gran krydsfiner, ubehandlet, Fobrænding","45 mm indervæg mod skakt, krydsfiner",16,"WISA Gran krydsfiner, ubehandlet, Fobrænding",316.8,190.0799999999999,null,null,"","","",null,"","","","","",""]
[null,null,null,null,null,null,null,null,"Ydervægge",{"$f":"SUMIF(Data[Undergruppe],'Unikke lister'!I54,Data[Vægt])","v":16386.754699999998},0.35046391817379302,1,{"$f":"SUMIF(Data[Undergruppe],'Unikke lister'!I54,Data[GWP sum])","v":4121.0747034999986},0.1601616126823418,3,null,null,{"$f":"IF(Q54=\"\",\"\",SUMIF(Data[Bygningsdel],'Unikke lister'!Q54,Data[Vægt]))","v":""},"","",{"$f":"IF(Q54=\"\",\"\",SUMIF(Data[Bygningsdel],'Unikke lister'!Q54,Data[GWP sum]))","v":""},"","",null,"Træbeklædning tilbagetrukket med ophæng",null,"Træbeklædning tilbagetrukket med ophæng",{"$f":"IF(Y54=\"\",\"\",SUMIF(Data[Konstruktion],'Unikke lister'!Y54,Data[Vægt]))","v":110.34989999999999},{"$f":"IF(Y54=\"\",\"\",SUMIF(Data[Konstruktion],'Unikke lister'!Y54,Data[GWP sum]))","v":26.470342800000001},null,"","","","","","",null,null,"Savede og tørrede konstruktionstræprodukter af fyr og gran, Fobrænding","60 mm skunkvægge, krydsfiner",17,"Savede og tørrede konstruktionstræprodukter af fyr og gran, Fobrænding",63.84,6.7200000000000131,null,null,"","","",null,"","","","","",""]
[null,null,null,null,null,null,null,null,null,null,null,null,null,null,null,null,null,{"$f":"IF(Q55=\"\",\"\",SUMIF(Data[Bygningsdel],'Unikke lister'!Q55,Data[Vægt]))","v":""},{"$f":"IF(Q55=\"\",\"\",R55/$R$3)","v":""},"",{"$f":"IF(Q55=\"\",\"\",SUMIF(Data[Bygningsdel],'Unikke lister'!Q55,Data[GWP sum]))","v":""},{"$f":"IF(Q55=\"\",\"\",U55/$U$3)","v":""},"",null,null,null,"",{"$f":"IF(Y55=\"\",\"\",SUMIF(Data[Konstruktion],'Unikke lister'!Y55,Data[Vægt]))","v":""},{"$f":"IF(Y55=\"\",\"\",SUMIF(Data[Konstruktion],'Unikke lister'!Y55,Data[GWP sum]))","v":""},null,"","","","","","",null,null,"WISA Gran krydsfiner, ubehandlet, Fobrænding","60 mm skunkvægge, krydsfiner",17,"WISA Gran krydsfiner, ubehandlet, Fobrænding",144,86.400000000000034,null,null,"","","",null,"","","","","",""]
[null,null,null,null,null,null,null,null,null,null,null,null,null,null,null,null,null,{"$f":"IF(Q56=\"\",\"\",SUMIF(Data[Bygningsdel],'Unikke lister'!Q56,Data[Vægt]))","v":""},"","",{"$f":"IF(Q56=\"\",\"\",SUMIF(Data[Bygningsdel],'Unikke lister'!Q56,Data[GWP sum]))","v":""},"","",null,null,null,"",{"$f":"IF(Y56=\"\",\"\",SUMIF(Data[Konstruktion],'Unikke lister'!Y56,Data[Vægt]))","v":""},{"$f":"IF(Y56=\"\",\"\",SUMIF(Data[Konstruktion],'Unikke lister'!Y56,Data[GWP sum]))","v":""},null,"","","","","","",null,null,"Savede og tørrede konstruktionstræprodukter af fyr og gran, Fobrænding","80 mm indervæg, krydsfiner",18,"Savede og tørrede konstruktionstræprodukter af fyr og gran, Fobrænding",10.26,1.08,null,null,"","","",null,"","","","","",""]
[null,null,null,null,null,null,null,null,null,null,null,null,null,null,null,null,null,{"$f":"IF(Q57=\"\",\"\",SUMIF(Data[Bygningsdel],'Unikke lister'!Q57,Data[Vægt]))","v":""},"","",{"$f":"IF(Q57=\"\",\"\",SUMIF(Data[Bygningsdel],'Unikke lister'!Q57,Data[GWP sum]))","v":""},"","",null,null,null,"",{"$f":"IF(Y57=\"\",\"\",SUMIF(Data[Konstruktion],'Unikke lister'!Y57,Data[Vægt]))","v":""},{"$f":"IF(Y57=\"\",\"\",SUMIF(Data[Konstruktion],'Unikke lister'!Y57,Data[GWP sum]))","v":""},null,"","","","","","",null,null,"Træfiberisolering (bats), kl. 38 - Hunton","80 mm indervæg, krydsfiner",18,"Træfiberisolering (bats), kl. 38 - Hunton",6.375,1.8495851249999991,null,null,"","","",null,"","","","","",""]
[null,null,null,null,null,null,null,null,null,null,null,null,null,null,null,null,null,{"$f":"IF(Q58=\"\",\"\",SUMIF(Data[Bygningsdel],'Unikke lister'!Q58,Data[Vægt]))","v":""},"","",{"$f":"IF(Q58=\"\",\"\",SUMIF(Data[Bygningsdel],'Unikke lister'!Q58,Data[GWP sum]))","v":""},"","",null,null,null,"",{"$f":"IF(Y58=\"\",\"\",SUMIF(Data[Konstruktion],'Unikke lister'!Y58,Data[Vægt]))","v":""},{"$f":"IF(Y58=\"\",\"\",SUMIF(Data[Konstruktion],'Unikke lister'!Y58,Data[GWP sum]))","v":""},null,"","","","","","",null,null,"WISA Gran krydsfiner, ubehandlet, Fobrænding","80 mm indervæg, krydsfiner",18,"WISA Gran krydsfiner, ubehandlet, Fobrænding",21.6,12.96000000000001,null,null,"","","",null,"","","","","",""]
[null,null,null,null,null,null,null,null,null,null,null,null,null,null,null,null,null,{"$f":"IF(Q59=\"\",\"\",SUMIF(Data[Bygningsdel],'Unikke lister'!Q59,Data[Vægt]))","v":""},"","",{"$f":"IF(Q59=\"\",\"\",SUMIF(Data[Bygningsdel],'Unikke lister'!Q59,Data[GWP sum]))","v":""},"","",null,null,null,"",{"$f":"IF(Y59=\"\",\"\",SUMIF(Data[Konstruktion],'Unikke lister'!Y59,Data[Vægt]))","v":""},{"$f":"IF(Y59=\"\",\"\",SUMIF(Data[Konstruktion],'Unikke lister'!Y59,Data[GWP sum]))","v":""},null,"","","","","","",null,null,"WISA Gran krydsfiner, ubehandlet, Fobrænding","80 mm indervæg, krydsfiner",18,"WISA Gran krydsfiner, ubehandlet, Fobrænding",21.6,12.96000000000001,null,null,"","","",null,"","","","","",""]
[null,null,null,null,null,null,null,null,null,null,null,null,null,null,null,null,null,{"$f":"IF(Q60=\"\",\"\",SUMIF(Data[Bygningsdel],'Unikke lister'!Q60,Data[Vægt]))","v":""},"","",{"$f":"IF(Q60=\"\",\"\",SUMIF(Data[Bygningsdel],'Unikke lister'!Q60,Data[GWP sum]))","v":""},"","",null,null,null,"",{"$f":"IF(Y60=\"\",\"\",SUMIF(Data[Konstruktion],'Unikke lister'!Y60,Data[Vægt]))","v":""},{"$f":"IF(Y60=\"\",\"\",SUMIF(Data[Konstruktion],'Unikke lister'!Y60,Data[GWP sum]))","v":""},null,"","","","","","",null,null,"Keramikfliser, glaseret","Klinkebeklædning på badeværelse",19,"Keramikfliser, glaseret",260,82.243642000000008,null,null,"","","",null,"","","","","",""]
[null,null,null,null,null,null,null,null,null,null,null,null,null,null,null,null,null,{"$f":"IF(Q61=\"\",\"\",SUMIF(Data[Bygningsdel],'Unikke lister'!Q61,Data[Vægt]))","v":""},"","",{"$f":"IF(Q61=\"\",\"\",SUMIF(Data[Bygningsdel],'Unikke lister'!Q61,Data[GWP sum]))","v":""},"","",null,null,null,"",{"$f":"IF(Y61=\"\",\"\",SUMIF(Data[Konstruktion],'Unikke lister'!Y61,Data[Vægt]))","v":""},{"$f":"IF(Y61=\"\",\"\",SUMIF(Data[Konstruktion],'Unikke lister'!Y61,Data[GWP sum]))","v":""},null,"","","","","","",null,null,"Mørtel, fliseklæber","Klinkebeklædning på badeværelse",19,"Mørtel, fliseklæber",41.6,15.11751072,null,null,"","","",null,"","","","","",""]
[null,null,null,null,null,null,null,null,null,null,null,null,null,null,null,null,null,{"$f":"IF(Q62=\"\",\"\",SUMIF(Data[Bygningsdel],'Unikke lister'!Q62,Data[Vægt]))","v":""},"","",{"$f":"IF(Q62=\"\",\"\",SUMIF(Data[Bygningsdel],'Unikke lister'!Q62,Data[GWP sum]))","v":""},"","",null,null,null,"",{"$f":"IF(Y62=\"\",\"\",SUMIF(Data[Konstruktion],'Unikke lister'!Y62,Data[Vægt]))","v":""},{"$f":"IF(Y62=\"\",\"\",SUMIF(Data[Konstruktion],'Unikke lister'!Y62,Data[GWP sum]))","v":""},null,"","","","","","",null,null,"Vandtætningsmembran, flydende","Klinkebeklædning på badeværelse",19,"Vandtætningsmembran, flydende",15.6,17.357542800000001,null,null,"","","",null,"","","","","",""]
[null,null,null,null,null,null,null,null,null,null,null,null,null,null,null,null,null,{"$f":"IF(Q63=\"\",\"\",SUMIF(Data[Bygningsdel],'Unikke lister'!Q63,Data[Vægt]))","v":""},"","",{"$f":"IF(Q63=\"\",\"\",SUMIF(Data[Bygningsdel],'Unikke lister'!Q63,Data[GWP sum]))","v":""},"","",null,null,null,"",{"$f":"IF(Y63=\"\",\"\",SUMIF(Data[Konstruktion],'Unikke lister'!Y63,Data[Vægt]))","v":""},{"$f":"IF(Y63=\"\",\"\",SUMIF(Data[Konstruktion],'Unikke lister'!Y63,Data[GWP sum]))","v":""},null,"","","","","","",null,null,"Limtræs-produkter af fyr og gran, Fobrænding","Limtræssøjle 140 x 140 mm",20,"Limtræs-produkter af fyr og gran, Fobrænding",52,13.83200000000001,null,null,"","","",null,"","","","","",""]
[null,null,null,null,null,null,null,null,null,null,null,null,null,null,null,null,null,{"$f":"IF(Q64=\"\",\"\",SUMIF(Data[Bygningsdel],'Unikke lister'!Q64,Data[Vægt]))","v":""},"","",{"$f":"IF(Q64=\"\",\"\",SUMIF(Data[Bygningsdel],'Unikke lister'!Q64,Data[GWP sum]))","v":""},"","",null,null,null,"",{"$f":"IF(Y64=\"\",\"\",SUMIF(Data[Konstruktion],'Unikke lister'!Y64,Data[Vægt]))","v":""},{"$f":"IF(Y64=\"\",\"\",SUMIF(Data[Konstruktion],'Unikke lister'!Y64,Data[GWP sum]))","v":""},null,"","","","","","",null,null,"Asfaltimprægneret porøs træfiberplade, 18 mm - Hunton Undertag","Tagkassette, ståltag",21,"Asfaltimprægneret porøs træfiberplade, 18 mm - Hunton Undertag",709.73399999999992,1240.8773249999999,null,null,"","","",null,"","","","","",""]
[null,null,null,null,null,null,null,null,null,null,null,null,null,null,null,null,null,{"$f":"IF(Q65=\"\",\"\",SUMIF(Data[Bygningsdel],'Unikke lister'!Q65,Data[Vægt]))","v":""},"","",{"$f":"IF(Q65=\"\",\"\",SUMIF(Data[Bygningsdel],'Unikke lister'!Q65,Data[GWP sum]))","v":""},"","",null,null,null,"",{"$f":"IF(Y65=\"\",\"\",SUMIF(Data[Konstruktion],'Unikke lister'!Y65,Data[Vægt]))","v":""},{"$f":"IF(Y65=\"\",\"\",SUMIF(Data[Konstruktion],'Unikke lister'!Y65,Data[GWP sum]))","v":""},null,"","","","","","",null,null,"Dampspærre PE (tykkelse 0,0002 m)","Tagkassette, ståltag",21,"Dampspærre PE (tykkelse 0,0002 m)",22.2,212.08881,null,null,"","","",null,"","","","","",""]
[null,null,null,null,null,null,null,null,null,null,null,null,null,null,null,null,null,{"$f":"IF(Q66=\"\",\"\",SUMIF(Data[Bygningsdel],'Unikke lister'!Q66,Data[Vægt]))","v":""},"","",{"$f":"IF(Q66=\"\",\"\",SUMIF(Data[Bygningsdel],'Unikke lister'!Q66,Data[GWP sum]))","v":""},"","",null,null,null,"",{"$f":"IF(Y66=\"\",\"\",SUMIF(Data[Konstruktion],'Unikke lister'!Y66,Data[Vægt]))","v":""},{"$f":"IF(Y66=\"\",\"\",SUMIF(Data[Konstruktion],'Unikke lister'!Y66,Data[GWP sum]))","v":""},null,"","","","","","",null,null,"Fermacell fiberplade 12,5 mm","Tagkassette, ståltag",21,"Fermacell fiberplade 12,5 mm",3274.5,297.7487643,null,null,"","","",null,"","","","","",""]
[null,null,null,null,null,null,null,null,null,null,null,null,null,null,null,null,null,{"$f":"IF(Q67=\"\",\"\",SUMIF(Data[Bygningsdel],'Unikke lister'!Q67,Data[Vægt]))","v":""},"","",{"$f":"IF(Q67=\"\",\"\",SUMIF(Data[Bygningsdel],'Unikke lister'!Q67,Data[GWP sum]))","v":""},"","",null,null,null,"",{"$f":"IF(Y67=\"\",\"\",SUMIF(Data[Konstruktion],'Unikke lister'!Y67,Data[Vægt]))","v":""},{"$f":"IF(Y67=\"\",\"\",SUMIF(Data[Konstruktion],'Unikke lister'!Y67,Data[GWP sum]))","v":""},null,"","","","","","",null,null,"Galvaniseret stålplade - Plannja","Tagkassette, ståltag",21,"Galvaniseret stålplade - Plannja",610.5,1589.2603154999999,null,null,"","","",null,"","","","","",""]
[null,null,null,null,null,null,null,null,null,null,null,null,null,null,null,null,null,{"$f":"IF(Q68=\"\",\"\",SUMIF(Data[Bygningsdel],'Unikke lister'!Q68,Data[Vægt]))","v":""},"","",{"$f":"IF(Q68=\"\",\"\",SUMIF(Data[Bygningsdel],'Unikke lister'!Q68,Data[GWP sum]))","v":""},"","",null,null,null,{"$f":"IF(Y68=\"\",\"\",IF(Z68=\"\",Y68,Z68))","v":""},{"$f":"IF(Y68=\"\",\"\",SUMIF(Data[Konstruktion],'Unikke lister'!Y68,Data[Vægt]))","v":""},{"$f":"IF(Y68=\"\",\"\",SUMIF(Data[Konstruktion],'Unikke lister'!Y68,Data[GWP sum]))","v":""},null,"","","","","","",null,null,"OSB2 Unsanded, Kronospan","Tagkassette, ståltag",21,"OSB2 Unsanded, Kronospan",1218.78,529.47000000000025,null,null,"","","",null,"","","","","",""]
[null,null,null,null,null,null,null,null,null,null,null,null,null,null,null,null,null,{"$f":"IF(Q69=\"\",\"\",SUMIF(Data[Bygningsdel],'Unikke lister'!Q69,Data[Vægt]))","v":""},"",{"$f":"IF(Q69=\"\",\"\",_xlfn.RANK.EQ(R69,$R$4:$R$100,0))","v":""},{"$f":"IF(Q69=\"\",\"\",SUMIF(Data[Bygningsdel],'Unikke lister'!Q69,Data[GWP sum]))","v":""},"",{"$f":"IF(Q69=\"\",\"\",_xlfn.RANK.EQ(U69,$U$4:$U$100,0))","v":""},null,null,null,"",{"$f":"IF(Y69=\"\",\"\",SUMIF(Data[Konstruktion],'Unikke lister'!Y69,Data[Vægt]))","v":""},{"$f":"IF(Y69=\"\",\"\",SUMIF(Data[Konstruktion],'Unikke lister'!Y69,Data[GWP sum]))","v":""},null,{"$f":"IF(AD69=\"\",\"\",SUMIF($AA$4:$AA$200,AD69,$AB$4:$AB$200))","v":""},{"$f":"IF(AD69=\"\",\"\",AE69/$AE$3)","v":""},{"$f":"IF(AD69=\"\",\"\",_xlfn.RANK.EQ(AE69,$AE$4:$AE$200,0))","v":""},{"$f":"IF(AD69=\"\",\"\",SUMIF($AA$4:$AA$200,AD69,$AC$4:$AC$200))","v":""},{"$f":"IF(AD69=\"\",\"\",AH69/$AH$3)","v":""},{"$f":"IF(AD69=\"\",\"\",_xlfn.RANK.EQ(AH69,$AH$4:$AH$200,0))","v":""},null,null,"Papirisolering kl 37 - ISOCELL","Tagkassette, ståltag",{"$f":"IF(AN69=\"\",\"\",IFERROR(MATCH(AN69,$AD$4:$AD$1000,0),_xlfn.XLOOKUP(AN69,$Y$4:$Y$1000,$AA$4:$AA$1000,\"\",0)))","v":21},{"$f":"IF(AN69=\"\",\"\",IF(N(AO69)=0,AO69,AM69))","v":"Papirisolering kl 37 - ISOCELL"},1509.6,664.22399999999971,null,null,{"$f":"IF(AS69=\"\",\"\",IF(AT69=\"\",AS69,AT69))","v":""},{"$f":"IF(AS69=\"\",\"\",SUMIF($AP$4:$AP$1000,AS69,$AQ$4:$AQ$1000))","v":""},{"$f":"IF(AS69=\"\",\"\",SUMIF($AP$4:$AP$1000,AS69,$AR$4:$AR$1000))","v":""},null,{"$f":"IF(AX69=\"\",\"\",SUMIF($AU$4:$AU$300,AX69,$AV$4:$AV$300))","v":""},{"$f":"IF(AX69=\"\",\"\",AY69/$AY$3)","v":""},{"$f":"IF(AX69=\"\",\"\",_xlfn.RANK.EQ(AY69,$AY$4:$AY$300,0))","v":""},{"$f":"IF(AX69=\"\",\"\",SUMIF($AU$4:$AU$300,AX69,$AW$4:$AW$300))","v":""},{"$f":"IF(AX69=\"\",\"\",BB69/$BB$3)","v":""},{"$f":"IF(AX69=\"\",\"\",_xlfn.RANK.EQ(BB69,$BB$4:$BB$300,0))","v":""}]
[null,null,null,null,null,null,null,null,null,null,null,null,null,null,null,null,null,{"$f":"IF(Q70=\"\",\"\",SUMIF(Data[Bygningsdel],'Unikke lister'!Q70,Data[Vægt]))","v":""},"","",{"$f":"IF(Q70=\"\",\"\",SUMIF(Data[Bygningsdel],'Unikke lister'!Q70,Data[GWP sum]))","v":""},"","",null,null,null,"",{"$f":"IF(Y70=\"\",\"\",SUMIF(Data[Konstruktion],'Unikke lister'!Y70,Data[Vægt]))","v":""},{"$f":"IF(Y70=\"\",\"\",SUMIF(Data[Konstruktion],'Unikke lister'!Y70,Data[GWP sum]))","v":""},null,"","","","","","",null,null,"Papirisolering kl 37 - ISOCELL","Tagkassette, ståltag",21,"Papirisolering kl 37 - ISOCELL",199.8,87.911999999999921,null,null,"","","",null,"","","","","",""]
[null,null,null,null,null,null,null,null,null,null,null,null,null,null,null,null,null,{"$f":"IF(Q71=\"\",\"\",SUMIF(Data[Bygningsdel],'Unikke lister'!Q71,Data[Vægt]))","v":""},"","",{"$f":"IF(Q71=\"\",\"\",SUMIF(Data[Bygningsdel],'Unikke lister'!Q71,Data[GWP sum]))","v":""},"","",null,null,null,"",{"$f":"IF(Y71=\"\",\"\",SUMIF(Data[Konstruktion],'Unikke lister'!Y71,Data[Vægt]))","v":""},{"$f":"IF(Y71=\"\",\"\",SUMIF(Data[Konstruktion],'Unikke lister'!Y71,Data[GWP sum]))","v":""},null,"","","","","","",null,null,"Savede og tørrede konstruktionstræprodukter af fyr og gran, Fobrænding","Tagkassette, ståltag",21,"Savede og tørrede konstruktionstræprodukter af fyr og gran, Fobrænding",354.31200000000001,37.296000000000049,null,null,"","","",null,"","","","","",""]
[null,null,null,null,null,null,null,null,null,null,null,null,null,null,null,null,null,{"$f":"IF(Q72=\"\",\"\",SUMIF(Data[Bygningsdel],'Unikke lister'!Q72,Data[Vægt]))","v":""},"","",{"$f":"IF(Q72=\"\",\"\",SUMIF(Data[Bygningsdel],'Unikke lister'!Q72,Data[GWP sum]))","v":""},"","",null,null,null,"",{"$f":"IF(Y72=\"\",\"\",SUMIF(Data[Konstruktion],'Unikke lister'!Y72,Data[Vægt]))","v":""},{"$f":"IF(Y72=\"\",\"\",SUMIF(Data[Konstruktion],'Unikke lister'!Y72,Data[GWP sum]))","v":""},null,"","","","","","",null,null,"Savede og tørrede konstruktionstræprodukter af fyr og gran, Fobrænding","Tagkassette, ståltag",21,"Savede og tørrede konstruktionstræprodukter af fyr og gran, Fobrænding",0.222,2.3368421052631538E-2,null,null,"","","",null,"","","","","",""]
[null,null,null,null,null,null,null,null,null,null,null,null,null,null,null,null,null,{"$f":"IF(Q73=\"\",\"\",SUMIF(Data[Bygningsdel],'Unikke lister'!Q73,Data[Vægt]))","v":""},"","",{"$f":"IF(Q73=\"\",\"\",SUMIF(Data[Bygningsdel],'Unikke lister'!Q73,Data[GWP sum]))","v":""},"","",null,null,null,"",{"$f":"IF(Y73=\"\",\"\",SUMIF(Data[Konstruktion],'Unikke lister'!Y73,Data[Vægt]))","v":""},{"$f":"IF(Y73=\"\",\"\",SUMIF(Data[Konstruktion],'Unikke lister'!Y73,Data[GWP sum]))","v":""},null,"","","","","","",null,null,"Savede og tørrede konstruktionstræprodukter af fyr og gran, Fobrænding","Tagkassette, ståltag",21,"Savede og tørrede konstruktionstræprodukter af fyr og gran, Fobrænding",404.928,42.62399999999991,null,null,"","","",null,"","","","","",""]
[null,null,null,null,null,null,null,null,null,null,null,null,null,null,null,null,null,{"$f":"IF(Q74=\"\",\"\",SUMIF(Data[Bygningsdel],'Unikke lister'!Q74,Data[Vægt]))","v":""},"","",{"$f":"IF(Q74=\"\",\"\",SUMIF(Data[Bygningsdel],'Unikke lister'!Q74,Data[GWP sum]))","v":""},"","",null,null,null,"",{"$f":"IF(Y74=\"\",\"\",SUMIF(Data[Konstruktion],'Unikke lister'!Y74,Data[Vægt]))","v":""},{"$f":"IF(Y74=\"\",\"\",SUMIF(Data[Konstruktion],'Unikke lister'!Y74,Data[GWP sum]))","v":""},null,"","","","","","",null,null,"Savede og tørrede konstruktionstræprodukter af fyr og gran, Fobrænding","Tagkassette, ståltag",21,"Savede og tørrede konstruktionstræprodukter af fyr og gran, Fobrænding",2227.1039999999998,234.43200000000019,null,null,"","","",null,"","","","","",""]
[null,null,null,null,null,null,null,null,null,null,null,null,null,null,null,null,null,{"$f":"IF(Q75=\"\",\"\",SUMIF(Data[Bygningsdel],'Unikke lister'!Q75,Data[Vægt]))","v":""},"","",{"$f":"IF(Q75=\"\",\"\",SUMIF(Data[Bygningsdel],'Unikke lister'!Q75,Data[GWP sum]))","v":""},"","",null,null,null,"",{"$f":"IF(Y75=\"\",\"\",SUMIF(Data[Konstruktion],'Unikke lister'!Y75,Data[Vægt]))","v":""},{"$f":"IF(Y75=\"\",\"\",SUMIF(Data[Konstruktion],'Unikke lister'!Y75,Data[GWP sum]))","v":""},null,"","","","","","",null,null,"Savede og tørrede konstruktionstræprodukter af fyr og gran, Fobrænding","Tagkassette, ståltag",21,"Savede og tørrede konstruktionstræprodukter af fyr og gran, Fobrænding",354.31200000000001,37.296000000000049,null,null,"","","",null,"","","","","",""]
[null,null,null,null,null,null,null,null,null,null,null,null,null,null,null,null,null,{"$f":"IF(Q76=\"\",\"\",SUMIF(Data[Bygningsdel],'Unikke lister'!Q76,Data[Vægt]))","v":""},"","",{"$f":"IF(Q76=\"\",\"\",SUMIF(Data[Bygningsdel],'Unikke lister'!Q76,Data[GWP sum]))","v":""},"","",null,null,null,"",{"$f":"IF(Y76=\"\",\"\",SUMIF(Data[Konstruktion],'Unikke lister'!Y76,Data[Vægt]))","v":""},{"$f":"IF(Y76=\"\",\"\",SUMIF(Data[Konstruktion],'Unikke lister'!Y76,Data[GWP sum]))","v":""},null,"","","","","","",null,null,"Dampspærre PE (tykkelse 0,0002 m)","Tagkassette, tagpap",22,"Dampspærre PE (tykkelse 0,0002 m)",3,28.66065,null,null,"","","",null,"","","","","",""]
[null,null,null,null,null,null,null,null,null,null,null,null,null,null,null,null,null,{"$f":"IF(Q77=\"\",\"\",SUMIF(Data[Bygningsdel],'Unikke lister'!Q77,Data[Vægt]))","v":""},"","",{"$f":"IF(Q77=\"\",\"\",SUMIF(Data[Bygningsdel],'Unikke lister'!Q77,Data[GWP sum]))","v":""},"","",null,null,null,"",{"$f":"IF(Y77=\"\",\"\",SUMIF(Data[Konstruktion],'Unikke lister'!Y77,Data[Vægt]))","v":""},{"$f":"IF(Y77=\"\",\"\",SUMIF(Data[Konstruktion],'Unikke lister'!Y77,Data[GWP sum]))","v":""},null,"","","","","","",null,null,"Derbigum NT","Tagkassette, tagpap",22,"Derbigum NT",132.15,154.44454500000001,null,null,"","","",null,"","","","","",""]
[null,null,null,null,null,null,null,null,null,null,null,null,null,null,null,null,null,{"$f":"IF(Q78=\"\",\"\",SUMIF(Data[Bygningsdel],'Unikke lister'!Q78,Data[Vægt]))","v":""},"","",{"$f":"IF(Q78=\"\",\"\",SUMIF(Data[Bygningsdel],'Unikke lister'!Q78,Data[GWP sum]))","v":""},"","",null,null,null,"",{"$f":"IF(Y78=\"\",\"\",SUMIF(Data[Konstruktion],'Unikke lister'!Y78,Data[Vægt]))","v":""},{"$f":"IF(Y78=\"\",\"\",SUMIF(Data[Konstruktion],'Unikke lister'!Y78,Data[GWP sum]))","v":""},null,"","","","","","",null,null,"Fermacell fiberplade 12,5 mm","Tagkassette, tagpap",22,"Fermacell fiberplade 12,5 mm",442.5,40.236319499999993,null,null,"","","",null,"","","","","",""]
[null,null,null,null,null,null,null,null,null,null,null,null,null,null,null,null,null,{"$f":"IF(Q79=\"\",\"\",SUMIF(Data[Bygningsdel],'Unikke lister'!Q79,Data[Vægt]))","v":""},"","",{"$f":"IF(Q79=\"\",\"\",SUMIF(Data[Bygningsdel],'Unikke lister'!Q79,Data[GWP sum]))","v":""},"","",null,null,null,"",{"$f":"IF(Y79=\"\",\"\",SUMIF(Data[Konstruktion],'Unikke lister'!Y79,Data[Vægt]))","v":""},{"$f":"IF(Y79=\"\",\"\",SUMIF(Data[Konstruktion],'Unikke lister'!Y79,Data[GWP sum]))","v":""},null,"","","","","","",null,null,"OSB2 Unsanded, Kronospan","Tagkassette, tagpap",22,"OSB2 Unsanded, Kronospan",164.7,71.549999999999983,null,null,"","","",null,"","","","","",""]
[null,null,null,null,null,null,null,null,null,null,null,null,null,null,null,null,null,{"$f":"IF(Q80=\"\",\"\",SUMIF(Data[Bygningsdel],'Unikke lister'!Q80,Data[Vægt]))","v":""},"","",{"$f":"IF(Q80=\"\",\"\",SUMIF(Data[Bygningsdel],'Unikke lister'!Q80,Data[GWP sum]))","v":""},"","",null,null,null,"",{"$f":"IF(Y80=\"\",\"\",SUMIF(Data[Konstruktion],'Unikke lister'!Y80,Data[Vægt]))","v":""},{"$f":"IF(Y80=\"\",\"\",SUMIF(Data[Konstruktion],'Unikke lister'!Y80,Data[GWP sum]))","v":""},null,"","","","","","",null,null,"Papirisolering kl 37 - ISOCELL","Tagkassette, tagpap",22,"Papirisolering kl 37 - ISOCELL",204,89.760000000000048,null,null,"","","",null,"","","","","",""]
[null,null,null,null,null,null,null,null,null,null,null,null,null,null,null,null,null,{"$f":"IF(Q81=\"\",\"\",SUMIF(Data[Bygningsdel],'Unikke lister'!Q81,Data[Vægt]))","v":""},"","",{"$f":"IF(Q81=\"\",\"\",SUMIF(Data[Bygningsdel],'Unikke lister'!Q81,Data[GWP sum]))","v":""},"","",null,null,null,"",{"$f":"IF(Y81=\"\",\"\",SUMIF(Data[Konstruktion],'Unikke lister'!Y81,Data[Vægt]))","v":""},{"$f":"IF(Y81=\"\",\"\",SUMIF(Data[Konstruktion],'Unikke lister'!Y81,Data[GWP sum]))","v":""},null,"","","","","","",null,null,"Papirisolering kl 37 - ISOCELL","Tagkassette, tagpap",22,"Papirisolering kl 37 - ISOCELL",27,11.88,null,null,"","","",null,"","","","","",""]
[null,null,null,null,null,null,null,null,null,null,null,null,null,null,null,null,null,{"$f":"IF(Q82=\"\",\"\",SUMIF(Data[Bygningsdel],'Unikke lister'!Q82,Data[Vægt]))","v":""},"","",{"$f":"IF(Q82=\"\",\"\",SUMIF(Data[Bygningsdel],'Unikke lister'!Q82,Data[GWP sum]))","v":""},"","",null,null,null,"",{"$f":"IF(Y82=\"\",\"\",SUMIF(Data[Konstruktion],'Unikke lister'!Y82,Data[Vægt]))","v":""},{"$f":"IF(Y82=\"\",\"\",SUMIF(Data[Konstruktion],'Unikke lister'!Y82,Data[GWP sum]))","v":""},null,"","","","","","",null,null,"Savede og tørrede konstruktionstræprodukter af fyr og gran, Fobrænding","Tagkassette, tagpap",22,"Savede og tørrede konstruktionstræprodukter af fyr og gran, Fobrænding",75.239999999999995,7.9200000000000017,null,null,"","","",null,"","","","","",""]
[null,null,null,null,null,null,null,null,null,null,null,null,null,null,null,null,null,{"$f":"IF(Q83=\"\",\"\",SUMIF(Data[Bygningsdel],'Unikke lister'!Q83,Data[Vægt]))","v":""},"","",{"$f":"IF(Q83=\"\",\"\",SUMIF(Data[Bygningsdel],'Unikke lister'!Q83,Data[GWP sum]))","v":""},"","",null,null,null,"",{"$f":"IF(Y83=\"\",\"\",SUMIF(Data[Konstruktion],'Unikke lister'!Y83,Data[Vægt]))","v":""},{"$f":"IF(Y83=\"\",\"\",SUMIF(Data[Konstruktion],'Unikke lister'!Y83,Data[GWP sum]))","v":""},null,"","","","","","",null,null,"Savede og tørrede konstruktionstræprodukter af fyr og gran, Fobrænding","Tagkassette, tagpap",22,"Savede og tørrede konstruktionstræprodukter af fyr og gran, Fobrænding",75.239999999999995,7.9200000000000017,null,null,"","","",null,"","","","","",""]
[null,null,null,null,null,null,null,null,null,null,null,null,null,null,null,null,null,{"$f":"IF(Q84=\"\",\"\",SUMIF(Data[Bygningsdel],'Unikke lister'!Q84,Data[Vægt]))","v":""},"","",{"$f":"IF(Q84=\"\",\"\",SUMIF(Data[Bygningsdel],'Unikke lister'!Q84,Data[GWP sum]))","v":""},"","",null,null,null,"",{"$f":"IF(Y84=\"\",\"\",SUMIF(Data[Konstruktion],'Unikke lister'!Y84,Data[Vægt]))","v":""},{"$f":"IF(Y84=\"\",\"\",SUMIF(Data[Konstruktion],'Unikke lister'!Y84,Data[GWP sum]))","v":""},null,"","","","","","",null,null,"Savede og tørrede konstruktionstræprodukter af fyr og gran, Fobrænding","Tagkassette, tagpap",22,"Savede og tørrede konstruktionstræprodukter af fyr og gran, Fobrænding",300.95999999999998,31.68000000000001,null,null,"","","",null,"","","","","",""]
[null,null,null,null,null,null,null,null,null,null,null,null,null,null,null,null,null,{"$f":"IF(Q85=\"\",\"\",SUMIF(Data[Bygningsdel],'Unikke lister'!Q85,Data[Vægt]))","v":""},"","",{"$f":"IF(Q85=\"\",\"\",SUMIF(Data[Bygningsdel],'Unikke lister'!Q85,Data[GWP sum]))","v":""},"","",null,null,null,"",{"$f":"IF(Y85=\"\",\"\",SUMIF(Data[Konstruktion],'Unikke lister'!Y85,Data[Vægt]))","v":""},{"$f":"IF(Y85=\"\",\"\",SUMIF(Data[Konstruktion],'Unikke lister'!Y85,Data[GWP sum]))","v":""},null,"","","","","","",null,null,"Savede og tørrede konstruktionstræprodukter af fyr og gran, Fobrænding","Tagkassette, tagpap",22,"Savede og tørrede konstruktionstræprodukter af fyr og gran, Fobrænding",47.88,5.039999999999992,null,null,"","","",null,"","","","","",""]
[null,null,null,null,null,null,null,null,null,null,null,null,null,null,null,null,null,{"$f":"IF(Q86=\"\",\"\",SUMIF(Data[Bygningsdel],'Unikke lister'!Q86,Data[Vægt]))","v":""},"","",{"$f":"IF(Q86=\"\",\"\",SUMIF(Data[Bygningsdel],'Unikke lister'!Q86,Data[GWP sum]))","v":""},"","",null,null,null,"",{"$f":"IF(Y86=\"\",\"\",SUMIF(Data[Konstruktion],'Unikke lister'!Y86,Data[Vægt]))","v":""},{"$f":"IF(Y86=\"\",\"\",SUMIF(Data[Konstruktion],'Unikke lister'!Y86,Data[GWP sum]))","v":""},null,"","","","","","",null,null,"WISA Gran krydsfiner, ubehandlet, Fobrænding","Tagkassette, tagpap",22,"WISA Gran krydsfiner, ubehandlet, Fobrænding",151.19999999999999,45.359999999999957,null,null,"","","",null,"","","","","",""]
[null,null,null,null,null,null,null,null,null,null,null,null,null,null,null,null,null,{"$f":"IF(Q87=\"\",\"\",SUMIF(Data[Bygningsdel],'Unikke lister'!Q87,Data[Vægt]))","v":""},"","",{"$f":"IF(Q87=\"\",\"\",SUMIF(Data[Bygningsdel],'Unikke lister'!Q87,Data[GWP sum]))","v":""},"","",null,null,null,"",{"$f":"IF(Y87=\"\",\"\",SUMIF(Data[Konstruktion],'Unikke lister'!Y87,Data[Vægt]))","v":""},{"$f":"IF(Y87=\"\",\"\",SUMIF(Data[Konstruktion],'Unikke lister'!Y87,Data[GWP sum]))","v":""},null,"","","","","","",null,null,"WISA Gran krydsfiner, ubehandlet, Fobrænding","Tagkassette, tagpap",22,"WISA Gran krydsfiner, ubehandlet, Fobrænding",151.19999999999999,45.359999999999957,null,null,"","","",null,"","","","","",""]
[null,null,null,null,null,null,null,null,null,null,null,null,null,null,null,null,null,{"$f":"IF(Q88=\"\",\"\",SUMIF(Data[Bygningsdel],'Unikke lister'!Q88,Data[Vægt]))","v":""},"","",{"$f":"IF(Q88=\"\",\"\",SUMIF(Data[Bygningsdel],'Unikke lister'!Q88,Data[GWP sum]))","v":""},"","",null,null,null,"",{"$f":"IF(Y88=\"\",\"\",SUMIF(Data[Konstruktion],'Unikke lister'!Y88,Data[Vægt]))","v":""},{"$f":"IF(Y88=\"\",\"\",SUMIF(Data[Konstruktion],'Unikke lister'!Y88,Data[GWP sum]))","v":""},null,"","","","","","",null,null,"Afretningslag, cementbaseret","Gulv, vådrumsgulv, keramiske fliser (Klon)",23,"Afretningslag, cementbaseret",600,119.1339,null,null,"","","",null,"","","","","",""]
[null,null,null,null,null,null,null,null,null,null,null,null,null,null,null,null,null,{"$f":"IF(Q89=\"\",\"\",SUMIF(Data[Bygningsdel],'Unikke lister'!Q89,Data[Vægt]))","v":""},"","",{"$f":"IF(Q89=\"\",\"\",SUMIF(Data[Bygningsdel],'Unikke lister'!Q89,Data[GWP sum]))","v":""},"","",null,null,null,"",{"$f":"IF(Y89=\"\",\"\",SUMIF(Data[Konstruktion],'Unikke lister'!Y89,Data[Vægt]))","v":""},{"$f":"IF(Y89=\"\",\"\",SUMIF(Data[Konstruktion],'Unikke lister'!Y89,Data[GWP sum]))","v":""},null,"","","","","","",null,null,"Keramikfliser, glaseret","Gulv, vådrumsgulv, keramiske fliser (Klon)",23,"Keramikfliser, glaseret",100,31.632169999999999,null,null,"","","",null,"","","","","",""]
[null,null,null,null,null,null,null,null,null,null,null,null,null,null,null,null,null,{"$f":"IF(Q90=\"\",\"\",SUMIF(Data[Bygningsdel],'Unikke lister'!Q90,Data[Vægt]))","v":""},"","",{"$f":"IF(Q90=\"\",\"\",SUMIF(Data[Bygningsdel],'Unikke lister'!Q90,Data[GWP sum]))","v":""},"","",null,null,null,"",{"$f":"IF(Y90=\"\",\"\",SUMIF(Data[Konstruktion],'Unikke lister'!Y90,Data[Vægt]))","v":""},{"$f":"IF(Y90=\"\",\"\",SUMIF(Data[Konstruktion],'Unikke lister'!Y90,Data[GWP sum]))","v":""},null,"","","","","","",null,null,"Mørtel, fliseklæber","Gulv, vådrumsgulv, keramiske fliser (Klon)",23,"Mørtel, fliseklæber",15.5,5.6327263500000004,null,null,"","","",null,"","","","","",""]
[null,null,null,null,null,null,null,null,null,null,null,null,null,null,null,null,null,{"$f":"IF(Q91=\"\",\"\",SUMIF(Data[Bygningsdel],'Unikke lister'!Q91,Data[Vægt]))","v":""},"","",{"$f":"IF(Q91=\"\",\"\",SUMIF(Data[Bygningsdel],'Unikke lister'!Q91,Data[GWP sum]))","v":""},"","",null,null,null,"",{"$f":"IF(Y91=\"\",\"\",SUMIF(Data[Konstruktion],'Unikke lister'!Y91,Data[Vægt]))","v":""},{"$f":"IF(Y91=\"\",\"\",SUMIF(Data[Konstruktion],'Unikke lister'!Y91,Data[GWP sum]))","v":""},null,"","","","","","",null,null,"Vandtætningsmembran, flydende","Gulv, vådrumsgulv, keramiske fliser (Klon)",23,"Vandtætningsmembran, flydende",6,6.6759779999999997,null,null,"","","",null,"","","","","",""]
[null,null,null,null,null,null,null,null,null,null,null,null,null,null,null,null,null,{"$f":"IF(Q92=\"\",\"\",SUMIF(Data[Bygningsdel],'Unikke lister'!Q92,Data[Vægt]))","v":""},"","",{"$f":"IF(Q92=\"\",\"\",SUMIF(Data[Bygningsdel],'Unikke lister'!Q92,Data[GWP sum]))","v":""},"","",null,null,null,"",{"$f":"IF(Y92=\"\",\"\",SUMIF(Data[Konstruktion],'Unikke lister'!Y92,Data[Vægt]))","v":""},{"$f":"IF(Y92=\"\",\"\",SUMIF(Data[Konstruktion],'Unikke lister'!Y92,Data[GWP sum]))","v":""},null,"","","","","","",null,null,"Cembrit Windstopper Extreme, 9 mm","Let trækassette, terræn",24,"Cembrit Windstopper Extreme, 9 mm",806.4,525.05600000000004,null,null,"","","",null,"","","","","",""]
[null,null,null,null,null,null,null,null,null,null,null,null,null,null,null,null,null,{"$f":"IF(Q93=\"\",\"\",SUMIF(Data[Bygningsdel],'Unikke lister'!Q93,Data[Vægt]))","v":""},"","",{"$f":"IF(Q93=\"\",\"\",SUMIF(Data[Bygningsdel],'Unikke lister'!Q93,Data[GWP sum]))","v":""},"","",null,null,null,"",{"$f":"IF(Y93=\"\",\"\",SUMIF(Data[Konstruktion],'Unikke lister'!Y93,Data[Vægt]))","v":""},{"$f":"IF(Y93=\"\",\"\",SUMIF(Data[Konstruktion],'Unikke lister'!Y93,Data[GWP sum]))","v":""},null,"","","","","","",null,null,"Dampspærre PE (tykkelse 0,0002 m)","Let trækassette, terræn",24,"Dampspærre PE (tykkelse 0,0002 m)",11.2,53.499879999999997,null,null,"","","",null,"","","","","",""]
[null,null,null,null,null,null,null,null,null,null,null,null,null,null,null,null,null,{"$f":"IF(Q94=\"\",\"\",SUMIF(Data[Bygningsdel],'Unikke lister'!Q94,Data[Vægt]))","v":""},"","",{"$f":"IF(Q94=\"\",\"\",SUMIF(Data[Bygningsdel],'Unikke lister'!Q94,Data[GWP sum]))","v":""},"","",null,null,null,"",{"$f":"IF(Y94=\"\",\"\",SUMIF(Data[Konstruktion],'Unikke lister'!Y94,Data[Vægt]))","v":""},{"$f":"IF(Y94=\"\",\"\",SUMIF(Data[Konstruktion],'Unikke lister'!Y94,Data[GWP sum]))","v":""},null,"","","","","","",null,null,"Papirisolering kl 37 - ISOCELL","Let trækassette, terræn",24,"Papirisolering kl 37 - ISOCELL",800.80000000000007,176.17599999999999,null,null,"","","",null,"","","","","",""]
[null,null,null,null,null,null,null,null,null,null,null,null,null,null,null,null,null,{"$f":"IF(Q95=\"\",\"\",SUMIF(Data[Bygningsdel],'Unikke lister'!Q95,Data[Vægt]))","v":""},"","",{"$f":"IF(Q95=\"\",\"\",SUMIF(Data[Bygningsdel],'Unikke lister'!Q95,Data[GWP sum]))","v":""},"","",null,null,null,"",{"$f":"IF(Y95=\"\",\"\",SUMIF(Data[Konstruktion],'Unikke lister'!Y95,Data[Vægt]))","v":""},{"$f":"IF(Y95=\"\",\"\",SUMIF(Data[Konstruktion],'Unikke lister'!Y95,Data[GWP sum]))","v":""},null,"","","","","","",null,null,"Savede og tørrede konstruktionstræprodukter af fyr og gran, Fobrænding","Let trækassette, terræn",24,"Savede og tørrede konstruktionstræprodukter af fyr og gran, Fobrænding",1404.48,147.84000000000009,null,null,"","","",null,"","","","","",""]
[null,null,null,null,null,null,null,null,null,null,null,null,null,null,null,null,null,{"$f":"IF(Q96=\"\",\"\",SUMIF(Data[Bygningsdel],'Unikke lister'!Q96,Data[Vægt]))","v":""},"","",{"$f":"IF(Q96=\"\",\"\",SUMIF(Data[Bygningsdel],'Unikke lister'!Q96,Data[GWP sum]))","v":""},"","",null,null,null,"",{"$f":"IF(Y96=\"\",\"\",SUMIF(Data[Konstruktion],'Unikke lister'!Y96,Data[Vægt]))","v":""},{"$f":"IF(Y96=\"\",\"\",SUMIF(Data[Konstruktion],'Unikke lister'!Y96,Data[GWP sum]))","v":""},null,"","","","","","",null,null,"Spaandex spånplader, Spaandex spånplader (DK)","Let trækassette, terræn",24,"Spaandex spånplader, Spaandex spånplader (DK)",739.19999999999993,221.75999999999991,null,null,"","","",null,"","","","","",""]
[null,null,null,null,null,null,null,null,null,null,null,null,null,null,null,null,null,{"$f":"IF(Q97=\"\",\"\",SUMIF(Data[Bygningsdel],'Unikke lister'!Q97,Data[Vægt]))","v":""},"","",{"$f":"IF(Q97=\"\",\"\",SUMIF(Data[Bygningsdel],'Unikke lister'!Q97,Data[GWP sum]))","v":""},"","",null,null,null,"",{"$f":"IF(Y97=\"\",\"\",SUMIF(Data[Konstruktion],'Unikke lister'!Y97,Data[Vægt]))","v":""},{"$f":"IF(Y97=\"\",\"\",SUMIF(Data[Konstruktion],'Unikke lister'!Y97,Data[GWP sum]))","v":""},null,"","","","","","",null,null,"Trinlydsdug - Scan Underlay","Trægulv terrændæk",25,"Trinlydsdug - Scan Underlay",48.3,24.164879620000001,null,null,"","","",null,"","","","","",""]
[null,null,null,null,null,null,null,null,null,null,null,null,null,null,null,null,null,{"$f":"IF(Q98=\"\",\"\",SUMIF(Data[Bygningsdel],'Unikke lister'!Q98,Data[Vægt]))","v":""},"","",{"$f":"IF(Q98=\"\",\"\",SUMIF(Data[Bygningsdel],'Unikke lister'!Q98,Data[GWP sum]))","v":""},"","",null,null,null,"",{"$f":"IF(Y98=\"\",\"\",SUMIF(Data[Konstruktion],'Unikke lister'!Y98,Data[Vægt]))","v":""},{"$f":"IF(Y98=\"\",\"\",SUMIF(Data[Konstruktion],'Unikke lister'!Y98,Data[GWP sum]))","v":""},null,"","","","","","",null,null,"Trægulv 14 mm ask - Tarkett Sverige","Trægulv terrændæk",25,"Trægulv 14 mm ask - Tarkett Sverige",363.4,212.06,null,null,"","","",null,"","","","","",""]
[null,null,null,null,null,null,null,null,null,null,null,null,null,null,null,null,null,{"$f":"IF(Q99=\"\",\"\",SUMIF(Data[Bygningsdel],'Unikke lister'!Q99,Data[Vægt]))","v":""},"","",{"$f":"IF(Q99=\"\",\"\",SUMIF(Data[Bygningsdel],'Unikke lister'!Q99,Data[GWP sum]))","v":""},"","",null,null,null,"",{"$f":"IF(Y99=\"\",\"\",SUMIF(Data[Konstruktion],'Unikke lister'!Y99,Data[Vægt]))","v":""},{"$f":"IF(Y99=\"\",\"\",SUMIF(Data[Konstruktion],'Unikke lister'!Y99,Data[GWP sum]))","v":""},null,"","","","","","",null,null,"Savede og tørrede konstruktionstræprodukter af fyr og gran, Fobrænding","Trætrappe pr. etage",26,"Savede og tørrede konstruktionstræprodukter af fyr og gran, Fobrænding",160,16.84210526315789,null,null,"","","",null,"","","","","",""]
[null,null,null,null,null,null,null,null,null,null,null,null,null,null,null,null,null,{"$f":"IF(Q100=\"\",\"\",SUMIF(Data[Bygningsdel],'Unikke lister'!Q100,Data[Vægt]))","v":""},"","",{"$f":"IF(Q100=\"\",\"\",SUMIF(Data[Bygningsdel],'Unikke lister'!Q100,Data[GWP sum]))","v":""},"","",null,null,null,"",{"$f":"IF(Y100=\"\",\"\",SUMIF(Data[Konstruktion],'Unikke lister'!Y100,Data[Vægt]))","v":""},{"$f":"IF(Y100=\"\",\"\",SUMIF(Data[Konstruktion],'Unikke lister'!Y100,Data[GWP sum]))","v":""},null,"","","","","","",null,null,"Trægulv 14 mm ask - Tarkett Sverige","Trætrappe pr. etage",26,"Trægulv 14 mm ask - Tarkett Sverige",71.100000000000009,41.489999999999988,null,null,"","","",null,"","","","","",""]
[null,null,null,null,null,null,null,null,null,null,null,null,null,null,null,null,null,null,null,null,null,null,null,null,null,null,"",{"$f":"IF(Y101=\"\",\"\",SUMIF(Data[Konstruktion],'Unikke lister'!Y101,Data[Vægt]))","v":""},{"$f":"IF(Y101=\"\",\"\",SUMIF(Data[Konstruktion],'Unikke lister'!Y101,Data[GWP sum]))","v":""},null,"","","","","","",null,null,"WISA Gran krydsfiner, ubehandlet, Fobrænding","Trætrappe pr. etage",26,"WISA Gran krydsfiner, ubehandlet, Fobrænding",43.2,12.96000000000001,null,null,"","","",null,"","","","","",""]
[null,null,null,null,null,null,null,null,null,null,null,null,null,null,null,null,null,null,null,null,null,null,null,null,null,null,"",{"$f":"IF(Y102=\"\",\"\",SUMIF(Data[Konstruktion],'Unikke lister'!Y102,Data[Vægt]))","v":""},{"$f":"IF(Y102=\"\",\"\",SUMIF(Data[Konstruktion],'Unikke lister'!Y102,Data[GWP sum]))","v":""},null,"","","","","","",null,null,"Brugsvandsrør, rustfri stål","Rustfrit stålrør",27,"Brugsvandsrør, rustfri stål",39,138.83618073,null,null,"","","",null,"","","","","",""]
[null,null,null,null,null,null,null,null,null,null,null,null,null,null,null,null,null,null,null,null,null,null,null,null,null,null,"",{"$f":"IF(Y103=\"\",\"\",SUMIF(Data[Konstruktion],'Unikke lister'!Y103,Data[Vægt]))","v":""},{"$f":"IF(Y103=\"\",\"\",SUMIF(Data[Konstruktion],'Unikke lister'!Y103,Data[GWP sum]))","v":""},null,"","","","","","",null,null,"Buffertank, rustfri stål","Metroair 330, indedel til VP","Varmepumpe","Varmepumpe",220,2077.5722000000001,null,null,"","","",null,"","","","","",""]
[null,null,null,null,null,null,null,null,null,null,null,null,null,null,null,null,null,null,null,null,null,null,null,null,null,null,"",{"$f":"IF(Y104=\"\",\"\",SUMIF(Data[Konstruktion],'Unikke lister'!Y104,Data[Vægt]))","v":""},{"$f":"IF(Y104=\"\",\"\",SUMIF(Data[Konstruktion],'Unikke lister'!Y104,Data[GWP sum]))","v":""},null,"","","","","","",null,null,"Magna3 25-(40/60/80/100/120)","Magna3 25-40",29,"Magna3 25-(40/60/80/100/120)",6.41,109.2852,null,null,"","","",null,"","","","","",""]
[null,null,null,null,null,null,null,null,null,null,null,null,null,null,null,null,null,null,null,null,null,null,null,null,null,null,"",{"$f":"IF(Y105=\"\",\"\",SUMIF(Data[Konstruktion],'Unikke lister'!Y105,Data[Vægt]))","v":""},{"$f":"IF(Y105=\"\",\"\",SUMIF(Data[Konstruktion],'Unikke lister'!Y105,Data[GWP sum]))","v":""},null,"","","","","","",null,null,"Panel radiator 500mm x 700mm - Lyngson","Radiator, 142/2000","Radiator","Radiator",16.158788562893999,67.528685815762003,null,null,"","","",null,"","","","","",""]
[null,null,null,null,null,null,null,null,null,null,null,null,null,null,null,null,null,null,null,null,null,null,null,null,null,null,"",{"$f":"IF(Y106=\"\",\"\",SUMIF(Data[Konstruktion],'Unikke lister'!Y106,Data[Vægt]))","v":""},{"$f":"IF(Y106=\"\",\"\",SUMIF(Data[Konstruktion],'Unikke lister'!Y106,Data[GWP sum]))","v":""},null,"","","","","","",null,null,"Panel radiator 500mm x 700mm - Lyngson","Radiator, 200/1000","Radiator","Radiator",22.758857125788001,95.110825071524019,null,null,"","","",null,"","","","","",""]
[null,null,null,null,null,null,null,null,null,null,null,null,null,null,null,null,null,null,null,null,null,null,null,null,null,null,"",{"$f":"IF(Y107=\"\",\"\",SUMIF(Data[Konstruktion],'Unikke lister'!Y107,Data[Vægt]))","v":""},{"$f":"IF(Y107=\"\",\"\",SUMIF(Data[Konstruktion],'Unikke lister'!Y107,Data[GWP sum]))","v":""},null,"","","","","","",null,null,"Panel radiator 500mm x 700mm - Lyngson","Radiator, 200/1100","Radiator","Radiator",12.517371437106,52.31095386423798,null,null,"","","",null,"","","","","",""]
[null,null,null,null,null,null,null,null,null,null,null,null,null,null,null,null,null,null,null,null,null,null,null,null,null,null,"",{"$f":"IF(Y108=\"\",\"\",SUMIF(Data[Konstruktion],'Unikke lister'!Y108,Data[Vægt]))","v":""},{"$f":"IF(Y108=\"\",\"\",SUMIF(Data[Konstruktion],'Unikke lister'!Y108,Data[GWP sum]))","v":""},null,"","","","","","",null,null,"Panel radiator 500mm x 700mm - Lyngson","Radiator, 200/2000","Radiator","Radiator",45.517714291403998,190.22165030949199,null,null,"","","",null,"","","","","",""]
[null,null,null,null,null,null,null,null,null,null,null,null,null,null,null,null,null,null,null,null,null,null,null,null,null,null,"",{"$f":"IF(Y109=\"\",\"\",SUMIF(Data[Konstruktion],'Unikke lister'!Y109,Data[Vægt]))","v":""},{"$f":"IF(Y109=\"\",\"\",SUMIF(Data[Konstruktion],'Unikke lister'!Y109,Data[GWP sum]))","v":""},null,"","","","","","",null,null,"Panel radiator 500mm x 700mm - Lyngson","Radiator, 200/600","Radiator","Radiator",6.8276571457020001,28.533247554745991,null,null,"","","",null,"","","","","",""]
[null,null,null,null,null,null,null,null,null,null,null,null,null,null,null,null,null,null,null,null,null,null,null,null,null,null,"",{"$f":"IF(Y110=\"\",\"\",SUMIF(Data[Konstruktion],'Unikke lister'!Y110,Data[Vægt]))","v":""},{"$f":"IF(Y110=\"\",\"\",SUMIF(Data[Konstruktion],'Unikke lister'!Y110,Data[GWP sum]))","v":""},null,"","","","","","",null,null,"Panel radiator 500mm x 700mm - Lyngson","Radiator, 300/400","Radiator","Radiator",6.8276571457020001,28.533247554745991,null,null,"","","",null,"","","","","",""]
[null,null,null,null,null,null,null,null,null,null,null,null,null,null,null,null,null,null,null,null,null,null,null,null,null,null,"",{"$f":"IF(Y111=\"\",\"\",SUMIF(Data[Konstruktion],'Unikke lister'!Y111,Data[Vægt]))","v":""},{"$f":"IF(Y111=\"\",\"\",SUMIF(Data[Konstruktion],'Unikke lister'!Y111,Data[GWP sum]))","v":""},null,"","","","","","",null,null,"Panel radiator 500mm x 700mm - Lyngson","Radiator, 600/900","Radiator","Radiator",30.724457145702001,128.399613954746,null,null,"","","",null,"","","","","",""]
[null,null,null,null,null,null,null,null,null,null,null,null,null,null,null,null,null,null,null,null,null,null,null,null,null,null,"",{"$f":"IF(Y112=\"\",\"\",SUMIF(Data[Konstruktion],'Unikke lister'!Y112,Data[Vægt]))","v":""},{"$f":"IF(Y112=\"\",\"\",SUMIF(Data[Konstruktion],'Unikke lister'!Y112,Data[GWP sum]))","v":""},null,"","","","","","",null,null,"Varmepumpe (luft-vand) 10 kW","Varmepumpe luft til vand ","Varmepumpe","Varmepumpe",83.08,611.76424239999994,null,null,"","","",null,"","","","","",""]
[null,null,null,null,null,null,null,null,null,null,null,null,null,null,null,null,null,null,null,null,null,null,null,null,null,null,"",{"$f":"IF(Y113=\"\",\"\",SUMIF(Data[Konstruktion],'Unikke lister'!Y113,Data[Vægt]))","v":""},{"$f":"IF(Y113=\"\",\"\",SUMIF(Data[Konstruktion],'Unikke lister'!Y113,Data[GWP sum]))","v":""},null,"","","","","","",null,null,"Brugsvandsrør, rustfri stål","Press rør",31,"Brugsvandsrør, rustfri stål",125.855,448.03147501985001,null,null,"","","",null,"","","","","",""]
[null,null,null,null,null,null,null,null,null,null,null,null,null,null,null,null,null,null,null,null,null,null,null,null,null,null,"",{"$f":"IF(Y114=\"\",\"\",SUMIF(Data[Konstruktion],'Unikke lister'!Y114,Data[Vægt]))","v":""},{"$f":"IF(Y114=\"\",\"\",SUMIF(Data[Konstruktion],'Unikke lister'!Y114,Data[GWP sum]))","v":""},null,"","","","","","",null,null,"Ventilationskanal, galvaniseret stål","Ventilationskanaler Ø125, enfamiliehuse og etageboliger, central",32,"Ventilationskanal, galvaniseret stål",1.5249999999999999,4.6495068792499996,null,null,"","","",null,"","","","","",""]
[null,null,null,null,null,null,null,null,null,null,null,null,null,null,null,null,null,null,null,null,null,null,null,null,null,null,"",{"$f":"IF(Y115=\"\",\"\",SUMIF(Data[Konstruktion],'Unikke lister'!Y115,Data[Vægt]))","v":""},{"$f":"IF(Y115=\"\",\"\",SUMIF(Data[Konstruktion],'Unikke lister'!Y115,Data[GWP sum]))","v":""},null,"","","","","","",null,null,"Fastgørelsesmidler/skruer i galvaniseret stål","Dør, indvendig","Indvendig dør","Indvendig dør",4,14.22276828,null,null,"","","",null,"","","","","",""]
[null,null,null,null,null,null,null,null,null,null,null,null,null,null,null,null,null,null,null,null,null,null,null,null,null,null,"",{"$f":"IF(Y116=\"\",\"\",SUMIF(Data[Konstruktion],'Unikke lister'!Y116,Data[Vægt]))","v":""},{"$f":"IF(Y116=\"\",\"\",SUMIF(Data[Konstruktion],'Unikke lister'!Y116,Data[GWP sum]))","v":""},null,"","","","","","",null,null,"Overflade, Indendørsmaling, emulsions maling, slidstærk","Dør, indvendig","Indvendig dør","Indvendig dør",1.43,3.7698167649999998,null,null,"","","",null,"","","","","",""]
[null,null,null,null,null,null,null,null,null,null,null,null,null,null,null,null,null,null,null,null,null,null,null,null,null,null,"",{"$f":"IF(Y117=\"\",\"\",SUMIF(Data[Konstruktion],'Unikke lister'!Y117,Data[Vægt]))","v":""},{"$f":"IF(Y117=\"\",\"\",SUMIF(Data[Konstruktion],'Unikke lister'!Y117,Data[GWP sum]))","v":""},null,"","","","","","",null,null,"Spånplade","Dør, indvendig","Indvendig dør","Indvendig dør",132,74.462331428571417,null,null,"","","",null,"","","","","",""]
[null,null,null,null,null,null,null,null,null,null,null,null,null,null,null,null,null,null,null,null,null,null,null,null,null,null,"",{"$f":"IF(Y118=\"\",\"\",SUMIF(Data[Konstruktion],'Unikke lister'!Y118,Data[Vægt]))","v":""},{"$f":"IF(Y118=\"\",\"\",SUMIF(Data[Konstruktion],'Unikke lister'!Y118,Data[GWP sum]))","v":""},null,"","","","","","",null,null,"Træ, fyrretræ (12% fugt / 10,7% H2O)","Dør, indvendig","Indvendig dør","Indvendig dør",40,14.717201166180759,null,null,"","","",null,"","","","","",""]
[null,null,null,null,null,null,null,null,null,null,null,null,null,null,null,null,null,null,null,null,null,null,null,null,null,null,"",{"$f":"IF(Y119=\"\",\"\",SUMIF(Data[Konstruktion],'Unikke lister'!Y119,Data[Vægt]))","v":""},{"$f":"IF(Y119=\"\",\"\",SUMIF(Data[Konstruktion],'Unikke lister'!Y119,Data[GWP sum]))","v":""},null,"","","","","","",null,null,"Grå støbejern","Udvendig dør, træ","Udvendig dør","Udvendig dør",0.105,0.17178441735,null,null,"","","",null,"","","","","",""]
[null,null,null,null,null,null,null,null,null,null,null,null,null,null,null,null,null,null,null,null,null,null,null,null,null,null,"",{"$f":"IF(Y120=\"\",\"\",SUMIF(Data[Konstruktion],'Unikke lister'!Y120,Data[Vægt]))","v":""},{"$f":"IF(Y120=\"\",\"\",SUMIF(Data[Konstruktion],'Unikke lister'!Y120,Data[GWP sum]))","v":""},null,"","","","","","",null,null,"Høvlede konstruktionstræsprodukter af fyr og gran, Fobrænding","Udvendig dør, træ","Udvendig dør","Udvendig dør",3.423,0.43538157894736779,null,null,"","","",null,"","","","","",""]
[null,null,null,null,null,null,null,null,null,null,null,null,null,null,null,null,null,null,null,null,null,null,null,null,null,null,"",{"$f":"IF(Y121=\"\",\"\",SUMIF(Data[Konstruktion],'Unikke lister'!Y121,Data[Vægt]))","v":""},{"$f":"IF(Y121=\"\",\"\",SUMIF(Data[Konstruktion],'Unikke lister'!Y121,Data[GWP sum]))","v":""},null,"","","","","","",null,null,"Savede og tørrede konstruktionstræprodukter af fyr og gran, Fobrænding","Udvendig dør, træ","Udvendig dør","Udvendig dør",47.313000000000002,9.9606315789473854,null,null,"","","",null,"","","","","",""]
[null,null,null,null,null,null,null,null,null,null,null,null,null,null,null,null,null,null,null,null,null,null,null,null,null,null,"",{"$f":"IF(Y122=\"\",\"\",SUMIF(Data[Konstruktion],'Unikke lister'!Y122,Data[Vægt]))","v":""},{"$f":"IF(Y122=\"\",\"\",SUMIF(Data[Konstruktion],'Unikke lister'!Y122,Data[GWP sum]))","v":""},null,"","","","","","",null,null,"Trævindue med 3-lags rude","Facadevinduer","Facadevindue","Facadevindue",752.40000000000009,2783,null,null,"","","",null,"","","","","",""]
[null,null,null,null,null,null,null,null,null,null,null,null,null,null,null,null,null,null,null,null,null,null,null,null,null,null,"",{"$f":"IF(Y123=\"\",\"\",SUMIF(Data[Konstruktion],'Unikke lister'!Y123,Data[Vægt]))","v":""},{"$f":"IF(Y123=\"\",\"\",SUMIF(Data[Konstruktion],'Unikke lister'!Y123,Data[GWP sum]))","v":""},null,"","","","","","",null,null,"Velux GGL ovenlys m. aluinddækning, 3-lagsrude (træ)","Velux GGL ovenlys m. aluinddækning, 3-lagsrude (træ)","Velux ovenlys","Velux ovenlys",394.3125,1431.8820000000001,null,null,"","","",null,"","","","","",""]
[null,null,null,null,null,null,null,null,null,null,null,null,null,null,null,null,null,null,null,null,null,null,null,null,null,null,"",{"$f":"IF(Y124=\"\",\"\",SUMIF(Data[Konstruktion],'Unikke lister'!Y124,Data[Vægt]))","v":""},{"$f":"IF(Y124=\"\",\"\",SUMIF(Data[Konstruktion],'Unikke lister'!Y124,Data[GWP sum]))","v":""},null,"","","","","","",null,null,"Velux modular skylight, 3-lagsrude","Velux modular skylight, 3-lagsrude","Velux fladt ovenlys","Velux fladt ovenlys",134.4,800.96,null,null,"","","",null,"","","","","",""]
[null,null,null,null,null,null,null,null,null,null,null,null,null,null,null,null,null,null,null,null,null,null,null,null,null,null,"",{"$f":"IF(Y125=\"\",\"\",SUMIF(Data[Konstruktion],'Unikke lister'!Y125,Data[Vægt]))","v":""},{"$f":"IF(Y125=\"\",\"\",SUMIF(Data[Konstruktion],'Unikke lister'!Y125,Data[GWP sum]))","v":""},null,"","","","","","",null,null,"Cembrit Windstopper Extreme, 9 mm","Facadekassette uden beklædning",38,"Cembrit Windstopper Extreme, 9 mm",2131.1999999999998,1387.6479999999999,null,null,"","","",null,"","","","","",""]
[null,null,null,null,null,null,null,null,null,null,null,null,null,null,null,null,null,null,null,null,null,null,null,null,null,null,"",{"$f":"IF(Y126=\"\",\"\",SUMIF(Data[Konstruktion],'Unikke lister'!Y126,Data[Vægt]))","v":""},{"$f":"IF(Y126=\"\",\"\",SUMIF(Data[Konstruktion],'Unikke lister'!Y126,Data[GWP sum]))","v":""},null,"","","","","","",null,null,"Dampspærre PE (tykkelse 0,0002 m)","Facadekassette uden beklædning",38,"Dampspærre PE (tykkelse 0,0002 m)",29.6,141.39254,null,null,"","","",null,"","","","","",""]
[null,null,null,null,null,null,null,null,null,null,null,null,null,null,null,null,null,null,null,null,null,null,null,null,null,null,"",{"$f":"IF(Y127=\"\",\"\",SUMIF(Data[Konstruktion],'Unikke lister'!Y127,Data[Vægt]))","v":""},{"$f":"IF(Y127=\"\",\"\",SUMIF(Data[Konstruktion],'Unikke lister'!Y127,Data[GWP sum]))","v":""},null,"","","","","","",null,null,"Fermacell fiberplade 12,5 mm","Facadekassette uden beklædning",38,"Fermacell fiberplade 12,5 mm",4366,396.99835239999999,null,null,"","","",null,"","","","","",""]
[null,null,null,null,null,null,null,null,null,null,null,null,null,null,null,null,null,null,null,null,null,null,null,null,null,null,"",{"$f":"IF(Y128=\"\",\"\",SUMIF(Data[Konstruktion],'Unikke lister'!Y128,Data[Vægt]))","v":""},{"$f":"IF(Y128=\"\",\"\",SUMIF(Data[Konstruktion],'Unikke lister'!Y128,Data[GWP sum]))","v":""},null,"","","","","","",null,null,"OSB2 Unsanded, Kronospan","Facadekassette uden beklædning",38,"OSB2 Unsanded, Kronospan",1625.04,705.96,null,null,"","","",null,"","","","","",""]
[null,null,null,null,null,null,null,null,null,null,null,null,null,null,null,null,null,null,null,null,null,null,null,null,null,null,"",{"$f":"IF(Y129=\"\",\"\",SUMIF(Data[Konstruktion],'Unikke lister'!Y129,Data[Vægt]))","v":""},{"$f":"IF(Y129=\"\",\"\",SUMIF(Data[Konstruktion],'Unikke lister'!Y129,Data[GWP sum]))","v":""},null,"","","","","","",null,null,"Papirisolering kl 37 - ISOCELL","Facadekassette uden beklædning",38,"Papirisolering kl 37 - ISOCELL",1850,407,null,null,"","","",null,"","","","","",""]
[null,null,null,null,null,null,null,null,null,null,null,null,null,null,null,null,null,null,null,null,null,null,null,null,null,null,"",{"$f":"IF(Y130=\"\",\"\",SUMIF(Data[Konstruktion],'Unikke lister'!Y130,Data[Vægt]))","v":""},{"$f":"IF(Y130=\"\",\"\",SUMIF(Data[Konstruktion],'Unikke lister'!Y130,Data[GWP sum]))","v":""},null,"","","","","","",null,null,"Papirisolering kl 37 - ISOCELL","Facadekassette uden beklædning",38,"Papirisolering kl 37 - ISOCELL",282.68,62.189600000000041,null,null,"","","",null,"","","","","",""]
[null,null,null,null,null,null,null,null,null,null,null,null,null,null,null,null,null,null,null,null,null,null,null,null,null,null,"",{"$f":"IF(Y131=\"\",\"\",SUMIF(Data[Konstruktion],'Unikke lister'!Y131,Data[Vægt]))","v":""},{"$f":"IF(Y131=\"\",\"\",SUMIF(Data[Konstruktion],'Unikke lister'!Y131,Data[GWP sum]))","v":""},null,"","","","","","",null,null,"Savede og tørrede konstruktionstræprodukter af fyr og gran, Fobrænding","Facadekassette uden beklædning",38,"Savede og tørrede konstruktionstræprodukter af fyr og gran, Fobrænding",2969.4720000000002,312.57599999999911,null,null,"","","",null,"","","","","",""]
[null,null,null,null,null,null,null,null,null,null,null,null,null,null,null,null,null,null,null,null,null,null,null,null,null,null,{"$f":"IF(Y132=\"\",\"\",IF(Z132=\"\",Y132,Z132))","v":""},{"$f":"IF(Y132=\"\",\"\",SUMIF(Data[Konstruktion],'Unikke lister'!Y132,Data[Vægt]))","v":""},{"$f":"IF(Y132=\"\",\"\",SUMIF(Data[Konstruktion],'Unikke lister'!Y132,Data[GWP sum]))","v":""},null,"","","","","","",null,null,"Savede og tørrede konstruktionstræprodukter af fyr og gran, Fobrænding","Facadekassette uden beklædning",38,"Savede og tørrede konstruktionstræprodukter af fyr og gran, Fobrænding",472.416,49.727999999999952,null,null,"","","",null,"","","","","",""]
[null,null,null,null,null,null,null,null,null,null,null,null,null,null,null,null,null,null,null,null,null,null,null,null,null,null,"",{"$f":"IF(Y133=\"\",\"\",SUMIF(Data[Konstruktion],'Unikke lister'!Y133,Data[Vægt]))","v":""},{"$f":"IF(Y133=\"\",\"\",SUMIF(Data[Konstruktion],'Unikke lister'!Y133,Data[GWP sum]))","v":""},null,{"$f":"IF(AD133=\"\",\"\",SUMIF($AA$4:$AA$200,AD133,$AB$4:$AB$200))","v":""},{"$f":"IF(AD133=\"\",\"\",AE133/$AE$3)","v":""},{"$f":"IF(AD133=\"\",\"\",_xlfn.RANK.EQ(AE133,$AE$4:$AE$200,0))","v":""},{"$f":"IF(AD133=\"\",\"\",SUMIF($AA$4:$AA$200,AD133,$AC$4:$AC$200))","v":""},{"$f":"IF(AD133=\"\",\"\",AH133/$AH$3)","v":""},{"$f":"IF(AD133=\"\",\"\",_xlfn.RANK.EQ(AH133,$AH$4:$AH$200,0))","v":""},null,null,"Cembrit Windstopper Extreme, 9 mm","Tilbagetrukket facadekassette uden beklædning",{"$f":"IF(AN133=\"\",\"\",IFERROR(MATCH(AN133,$AD$4:$AD$1000,0),_xlfn.XLOOKUP(AN133,$Y$4:$Y$1000,$AA$4:$AA$1000,\"\",0)))","v":39},{"$f":"IF(AN133=\"\",\"\",IF(N(AO133)=0,AO133,AM133))","v":"Cembrit Windstopper Extreme, 9 mm"},129.6,84.384,null,null,{"$f":"IF(AS133=\"\",\"\",IF(AT133=\"\",AS133,AT133))","v":""},{"$f":"IF(AS133=\"\",\"\",SUMIF($AP$4:$AP$1000,AS133,$AQ$4:$AQ$1000))","v":""},{"$f":"IF(AS133=\"\",\"\",SUMIF($AP$4:$AP$1000,AS133,$AR$4:$AR$1000))","v":""},null,{"$f":"IF(AX133=\"\",\"\",SUMIF($AU$4:$AU$300,AX133,$AV$4:$AV$300))","v":""},{"$f":"IF(AX133=\"\",\"\",AY133/$AY$3)","v":""},{"$f":"IF(AX133=\"\",\"\",_xlfn.RANK.EQ(AY133,$AY$4:$AY$300,0))","v":""},{"$f":"IF(AX133=\"\",\"\",SUMIF($AU$4:$AU$300,AX133,$AW$4:$AW$300))","v":""},{"$f":"IF(AX133=\"\",\"\",BB133/$BB$3)","v":""},{"$f":"IF(AX133=\"\",\"\",_xlfn.RANK.EQ(BB133,$BB$4:$BB$300,0))","v":""}]
[null,null,null,null,null,null,null,null,null,null,null,null,null,null,null,null,null,null,null,null,null,null,null,null,null,null,"",{"$f":"IF(Y134=\"\",\"\",SUMIF(Data[Konstruktion],'Unikke lister'!Y134,Data[Vægt]))","v":""},{"$f":"IF(Y134=\"\",\"\",SUMIF(Data[Konstruktion],'Unikke lister'!Y134,Data[GWP sum]))","v":""},null,"","","","","","",null,null,"Dampspærre PE (tykkelse 0,0002 m)","Tilbagetrukket facadekassette uden beklædning",39,"Dampspærre PE (tykkelse 0,0002 m)",1.8,8.5981950000000005,null,null,"","","",null,"","","","","",""]
[null,null,null,null,null,null,null,null,null,null,null,null,null,null,null,null,null,null,null,null,null,null,null,null,null,null,"",{"$f":"IF(Y135=\"\",\"\",SUMIF(Data[Konstruktion],'Unikke lister'!Y135,Data[Vægt]))","v":""},{"$f":"IF(Y135=\"\",\"\",SUMIF(Data[Konstruktion],'Unikke lister'!Y135,Data[GWP sum]))","v":""},null,"","","","","","",null,null,"Fermacell fiberplade 12,5 mm","Tilbagetrukket facadekassette uden beklædning",39,"Fermacell fiberplade 12,5 mm",265.5,24.141791699999999,null,null,"","","",null,"","","","","",""]
[null,null,null,null,null,null,null,null,null,null,null,null,null,null,null,null,null,null,null,null,null,null,null,null,null,null,"",{"$f":"IF(Y136=\"\",\"\",SUMIF(Data[Konstruktion],'Unikke lister'!Y136,Data[Vægt]))","v":""},{"$f":"IF(Y136=\"\",\"\",SUMIF(Data[Konstruktion],'Unikke lister'!Y136,Data[GWP sum]))","v":""},null,"","","","","","",null,null,"OSB2 Unsanded, Kronospan","Tilbagetrukket facadekassette uden beklædning",39,"OSB2 Unsanded, Kronospan",98.82,42.930000000000007,null,null,"","","",null,"","","","","",""]
[null,null,null,null,null,null,null,null,null,null,null,null,null,null,null,null,null,null,null,null,null,null,null,null,null,null,"",{"$f":"IF(Y137=\"\",\"\",SUMIF(Data[Konstruktion],'Unikke lister'!Y137,Data[Vægt]))","v":""},{"$f":"IF(Y137=\"\",\"\",SUMIF(Data[Konstruktion],'Unikke lister'!Y137,Data[GWP sum]))","v":""},null,"","","","","","",null,null,"Papirisolering kl 37 - ISOCELL","Tilbagetrukket facadekassette uden beklædning",39,"Papirisolering kl 37 - ISOCELL",74.7,16.434000000000001,null,null,"","","",null,"","","","","",""]
[null,null,null,null,null,null,null,null,null,null,null,null,null,null,null,null,null,null,null,null,null,null,null,null,null,null,"",{"$f":"IF(Y138=\"\",\"\",SUMIF(Data[Konstruktion],'Unikke lister'!Y138,Data[Vægt]))","v":""},{"$f":"IF(Y138=\"\",\"\",SUMIF(Data[Konstruktion],'Unikke lister'!Y138,Data[GWP sum]))","v":""},null,"","","","","","",null,null,"Papirisolering kl 37 - ISOCELL","Tilbagetrukket facadekassette uden beklædning",39,"Papirisolering kl 37 - ISOCELL",17.190000000000001,3.7818000000000001,null,null,"","","",null,"","","","","",""]
[null,null,null,null,null,null,null,null,null,null,null,null,null,null,null,null,null,null,null,null,null,null,null,null,null,null,"",{"$f":"IF(Y139=\"\",\"\",SUMIF(Data[Konstruktion],'Unikke lister'!Y139,Data[Vægt]))","v":""},{"$f":"IF(Y139=\"\",\"\",SUMIF(Data[Konstruktion],'Unikke lister'!Y139,Data[GWP sum]))","v":""},null,"","","","","","",null,null,"Savede og tørrede konstruktionstræprodukter af fyr og gran, Fobrænding","Tilbagetrukket facadekassette uden beklædning",39,"Savede og tørrede konstruktionstræprodukter af fyr og gran, Fobrænding",119.01600000000001,12.52799999999999,null,null,"","","",null,"","","","","",""]
[null,null,null,null,null,null,null,null,null,null,null,null,null,null,null,null,null,null,null,null,null,null,null,null,null,null,"",{"$f":"IF(Y140=\"\",\"\",SUMIF(Data[Konstruktion],'Unikke lister'!Y140,Data[Vægt]))","v":""},{"$f":"IF(Y140=\"\",\"\",SUMIF(Data[Konstruktion],'Unikke lister'!Y140,Data[GWP sum]))","v":""},null,"","","","","","",null,null,"Savede og tørrede konstruktionstræprodukter af fyr og gran, Fobrænding","Tilbagetrukket facadekassette uden beklædning",39,"Savede og tørrede konstruktionstræprodukter af fyr og gran, Fobrænding",28.728000000000002,3.0239999999999938,null,null,"","","",null,"","","","","",""]
[null,null,null,null,null,null,null,null,null,null,null,null,null,null,null,null,null,null,null,null,null,null,null,null,null,null,"",{"$f":"IF(Y141=\"\",\"\",SUMIF(Data[Konstruktion],'Unikke lister'!Y141,Data[Vægt]))","v":""},{"$f":"IF(Y141=\"\",\"\",SUMIF(Data[Konstruktion],'Unikke lister'!Y141,Data[GWP sum]))","v":""},null,"","","","","","",null,null,"Savede og tørrede konstruktionstræprodukter af fyr og gran, Fobrænding","Træbeklædning med ophæng",40,"Savede og tørrede konstruktionstræprodukter af fyr og gran, Fobrænding",134.976,14.208,null,null,"","","",null,"","","","","",""]
[null,null,null,null,null,null,null,null,null,null,null,null,null,null,null,null,null,null,null,null,null,null,null,null,null,null,"",{"$f":"IF(Y142=\"\",\"\",SUMIF(Data[Konstruktion],'Unikke lister'!Y142,Data[Vægt]))","v":""},{"$f":"IF(Y142=\"\",\"\",SUMIF(Data[Konstruktion],'Unikke lister'!Y142,Data[GWP sum]))","v":""},null,"","","","","","",null,null,"Savede og tørrede konstruktionstræprodukter af fyr og gran, Fobrænding","Træbeklædning med ophæng",40,"Savede og tørrede konstruktionstræprodukter af fyr og gran, Fobrænding",269.952,28.416,null,null,"","","",null,"","","","","",""]
[null,null,null,null,null,null,null,null,null,null,null,null,null,null,null,null,null,null,null,null,null,null,null,null,null,null,"",{"$f":"IF(Y143=\"\",\"\",SUMIF(Data[Konstruktion],'Unikke lister'!Y143,Data[Vægt]))","v":""},{"$f":"IF(Y143=\"\",\"\",SUMIF(Data[Konstruktion],'Unikke lister'!Y143,Data[GWP sum]))","v":""},null,"","","","","","",null,null,"Træbeklædning 19 mm, ubehandlet gran - InnTre Kjeldstad AS","Træbeklædning med ophæng",40,"Træbeklædning 19 mm, ubehandlet gran - InnTre Kjeldstad AS",1409.7148,392.6660816000001,null,null,"","","",null,"","","","","",""]
[null,null,null,null,null,null,null,null,null,null,null,null,null,null,null,null,null,null,null,null,null,null,null,null,null,null,"",{"$f":"IF(Y144=\"\",\"\",SUMIF(Data[Konstruktion],'Unikke lister'!Y144,Data[Vægt]))","v":""},{"$f":"IF(Y144=\"\",\"\",SUMIF(Data[Konstruktion],'Unikke lister'!Y144,Data[GWP sum]))","v":""},null,"","","","","","",null,null,"Savede og tørrede konstruktionstræprodukter af fyr og gran, Fobrænding","Træbeklædning tilbagetrukket med ophæng",41,"Savede og tørrede konstruktionstræprodukter af fyr og gran, Fobrænding",8.2080000000000002,0.86399999999999721,null,null,"","","",null,"","","","","",""]
[null,null,null,null,null,null,null,null,null,null,null,null,null,null,null,null,null,null,null,null,null,null,null,null,null,null,"",{"$f":"IF(Y145=\"\",\"\",SUMIF(Data[Konstruktion],'Unikke lister'!Y145,Data[Vægt]))","v":""},{"$f":"IF(Y145=\"\",\"\",SUMIF(Data[Konstruktion],'Unikke lister'!Y145,Data[GWP sum]))","v":""},null,"","","","","","",null,null,"Savede og tørrede konstruktionstræprodukter af fyr og gran, Fobrænding","Træbeklædning tilbagetrukket med ophæng",41,"Savede og tørrede konstruktionstræprodukter af fyr og gran, Fobrænding",16.416,1.727999999999994,null,null,"","","",null,"","","","","",""]
[null,null,null,null,null,null,null,null,null,null,null,null,null,null,null,null,null,null,null,null,null,null,null,null,null,null,"",{"$f":"IF(Y146=\"\",\"\",SUMIF(Data[Konstruktion],'Unikke lister'!Y146,Data[Vægt]))","v":""},{"$f":"IF(Y146=\"\",\"\",SUMIF(Data[Konstruktion],'Unikke lister'!Y146,Data[GWP sum]))","v":""},null,"","","","","","",null,null,"Træbeklædning 19 mm, ubehandlet gran - InnTre Kjeldstad AS","Træbeklædning tilbagetrukket med ophæng",41,"Træbeklædning 19 mm, ubehandlet gran - InnTre Kjeldstad AS",85.725899999999996,23.878342800000009,null,null,"","","",null,"","","","","",""]
[null,null,null,null,null,null,null,null,null,null,null,null,null,null,null,null,null,null,null,null,null,null,null,null,null,null,"",{"$f":"IF(Y147=\"\",\"\",SUMIF(Data[Konstruktion],'Unikke lister'!Y147,Data[Vægt]))","v":""},{"$f":"IF(Y147=\"\",\"\",SUMIF(Data[Konstruktion],'Unikke lister'!Y147,Data[GWP sum]))","v":""},null,"","","","","","",null,null,null,null,"","",null,null,null,null,"","","",null,"","","","","",""]
[null,null,null,null,null,null,null,null,null,null,null,null,null,null,null,null,null,null,null,null,null,null,null,null,null,null,"",{"$f":"IF(Y148=\"\",\"\",SUMIF(Data[Konstruktion],'Unikke lister'!Y148,Data[Vægt]))","v":""},{"$f":"IF(Y148=\"\",\"\",SUMIF(Data[Konstruktion],'Unikke lister'!Y148,Data[GWP sum]))","v":""},null,"","","","","","",null,null,null,null,"","",null,null,null,null,"","","",null,"","","","","",""]
[null,null,null,null,null,null,null,null,null,null,null,null,null,null,null,null,null,null,null,null,null,null,null,null,null,null,"",{"$f":"IF(Y149=\"\",\"\",SUMIF(Data[Konstruktion],'Unikke lister'!Y149,Data[Vægt]))","v":""},{"$f":"IF(Y149=\"\",\"\",SUMIF(Data[Konstruktion],'Unikke lister'!Y149,Data[GWP sum]))","v":""},null,"","","","","","",null,null,null,null,{"$f":"IF(AN149=\"\",\"\",IFERROR(MATCH(AN149,$AD$4:$AD$1000,0),_xlfn.XLOOKUP(AN149,$Y$4:$Y$1000,$AA$4:$AA$1000,\"\",0)))","v":""},{"$f":"IF(AN149=\"\",\"\",IF(N(AO149)=0,AO149,AM149))","v":""},null,null,null,null,"","","",null,"","","","","",""]
[null,null,null,null,null,null,null,null,null,null,null,null,null,null,null,null,null,null,null,null,null,null,null,null,null,null,"",{"$f":"IF(Y150=\"\",\"\",SUMIF(Data[Konstruktion],'Unikke lister'!Y150,Data[Vægt]))","v":""},{"$f":"IF(Y150=\"\",\"\",SUMIF(Data[Konstruktion],'Unikke lister'!Y150,Data[GWP sum]))","v":""},null,"","","","","","",null,null,null,null,"",{"$f":"IF(AN150=\"\",\"\",IF(N(AO150)=0,AO150,AM150))","v":""},null,null,null,null,"","","",null,"","","","","",""]
[null,null,null,null,null,null,null,null,null,null,null,null,null,null,null,null,null,null,null,null,null,null,null,null,null,null,"",{"$f":"IF(Y151=\"\",\"\",SUMIF(Data[Konstruktion],'Unikke lister'!Y151,Data[Vægt]))","v":""},{"$f":"IF(Y151=\"\",\"\",SUMIF(Data[Konstruktion],'Unikke lister'!Y151,Data[GWP sum]))","v":""},null,"","","","","","",null,null,null,null,"","",null,null,null,null,"","","",null,"","","","","",""]
[null,null,null,null,null,null,null,null,null,null,null,null,null,null,null,null,null,null,null,null,null,null,null,null,null,null,"",{"$f":"IF(Y152=\"\",\"\",SUMIF(Data[Konstruktion],'Unikke lister'!Y152,Data[Vægt]))","v":""},{"$f":"IF(Y152=\"\",\"\",SUMIF(Data[Konstruktion],'Unikke lister'!Y152,Data[GWP sum]))","v":""},null,"","","","","","",null,null,null,null,"","",null,null,null,null,"","","",null,"","","","","",""]
[null,null,null,null,null,null,null,null,null,null,null,null,null,null,null,null,null,null,null,null,null,null,null,null,null,null,"",{"$f":"IF(Y153=\"\",\"\",SUMIF(Data[Konstruktion],'Unikke lister'!Y153,Data[Vægt]))","v":""},{"$f":"IF(Y153=\"\",\"\",SUMIF(Data[Konstruktion],'Unikke lister'!Y153,Data[GWP sum]))","v":""},null,"","","","","","",null,null,null,null,"","",null,null,null,null,"","","",null,"","","","","",""]
[null,null,null,null,null,null,null,null,null,null,null,null,null,null,null,null,null,null,null,null,null,null,null,null,null,null,"",{"$f":"IF(Y154=\"\",\"\",SUMIF(Data[Konstruktion],'Unikke lister'!Y154,Data[Vægt]))","v":""},{"$f":"IF(Y154=\"\",\"\",SUMIF(Data[Konstruktion],'Unikke lister'!Y154,Data[GWP sum]))","v":""},null,"","","","","","",null,null,null,null,"","",null,null,null,null,"","","",null,"","","","","",""]
[null,null,null,null,null,null,null,null,null,null,null,null,null,null,null,null,null,null,null,null,null,null,null,null,null,null,"",{"$f":"IF(Y155=\"\",\"\",SUMIF(Data[Konstruktion],'Unikke lister'!Y155,Data[Vægt]))","v":""},{"$f":"IF(Y155=\"\",\"\",SUMIF(Data[Konstruktion],'Unikke lister'!Y155,Data[GWP sum]))","v":""},null,"","","","","","",null,null,null,null,"","",null,null,null,null,"","","",null,"","","","","",""]
[null,null,null,null,null,null,null,null,null,null,null,null,null,null,null,null,null,null,null,null,null,null,null,null,null,null,"",{"$f":"IF(Y156=\"\",\"\",SUMIF(Data[Konstruktion],'Unikke lister'!Y156,Data[Vægt]))","v":""},{"$f":"IF(Y156=\"\",\"\",SUMIF(Data[Konstruktion],'Unikke lister'!Y156,Data[GWP sum]))","v":""},null,"","","","","","",null,null,null,null,"","",null,null,null,null,"","","",null,"","","","","",""]
[null,null,null,null,null,null,null,null,null,null,null,null,null,null,null,null,null,null,null,null,null,null,null,null,null,null,"",{"$f":"IF(Y157=\"\",\"\",SUMIF(Data[Konstruktion],'Unikke lister'!Y157,Data[Vægt]))","v":""},{"$f":"IF(Y157=\"\",\"\",SUMIF(Data[Konstruktion],'Unikke lister'!Y157,Data[GWP sum]))","v":""},null,"","","","","","",null,null,null,null,"","",null,null,null,null,"","","",null,"","","","","",""]
[null,null,null,null,null,null,null,null,null,null,null,null,null,null,null,null,null,null,null,null,null,null,null,null,null,null,"",{"$f":"IF(Y158=\"\",\"\",SUMIF(Data[Konstruktion],'Unikke lister'!Y158,Data[Vægt]))","v":""},{"$f":"IF(Y158=\"\",\"\",SUMIF(Data[Konstruktion],'Unikke lister'!Y158,Data[GWP sum]))","v":""},null,"","","","","","",null,null,null,null,"","",null,null,null,null,"","","",null,"","","","","",""]
[null,null,null,null,null,null,null,null,null,null,null,null,null,null,null,null,null,null,null,null,null,null,null,null,null,null,"",{"$f":"IF(Y159=\"\",\"\",SUMIF(Data[Konstruktion],'Unikke lister'!Y159,Data[Vægt]))","v":""},{"$f":"IF(Y159=\"\",\"\",SUMIF(Data[Konstruktion],'Unikke lister'!Y159,Data[GWP sum]))","v":""},null,"","","","","","",null,null,null,null,"","",null,null,null,null,"","","",null,"","","","","",""]
[null,null,null,null,null,null,null,null,null,null,null,null,null,null,null,null,null,null,null,null,null,null,null,null,null,null,"",{"$f":"IF(Y160=\"\",\"\",SUMIF(Data[Konstruktion],'Unikke lister'!Y160,Data[Vægt]))","v":""},{"$f":"IF(Y160=\"\",\"\",SUMIF(Data[Konstruktion],'Unikke lister'!Y160,Data[GWP sum]))","v":""},null,"","","","","","",null,null,null,null,"","",null,null,null,null,"","","",null,"","","","","",""]
[null,null,null,null,null,null,null,null,null,null,null,null,null,null,null,null,null,null,null,null,null,null,null,null,null,null,"",{"$f":"IF(Y161=\"\",\"\",SUMIF(Data[Konstruktion],'Unikke lister'!Y161,Data[Vægt]))","v":""},{"$f":"IF(Y161=\"\",\"\",SUMIF(Data[Konstruktion],'Unikke lister'!Y161,Data[GWP sum]))","v":""},null,"","","","","","",null,null,null,null,"","",null,null,null,null,"","","",null,"","","","","",""]
[null,null,null,null,null,null,null,null,null,null,null,null,null,null,null,null,null,null,null,null,null,null,null,null,null,null,"",{"$f":"IF(Y162=\"\",\"\",SUMIF(Data[Konstruktion],'Unikke lister'!Y162,Data[Vægt]))","v":""},{"$f":"IF(Y162=\"\",\"\",SUMIF(Data[Konstruktion],'Unikke lister'!Y162,Data[GWP sum]))","v":""},null,"","","","","","",null,null,null,null,"","",null,null,null,null,"","","",null,"","","","","",""]
[null,null,null,null,null,null,null,null,null,null,null,null,null,null,null,null,null,null,null,null,null,null,null,null,null,null,"",{"$f":"IF(Y163=\"\",\"\",SUMIF(Data[Konstruktion],'Unikke lister'!Y163,Data[Vægt]))","v":""},{"$f":"IF(Y163=\"\",\"\",SUMIF(Data[Konstruktion],'Unikke lister'!Y163,Data[GWP sum]))","v":""},null,"","","","","","",null,null,null,null,"","",null,null,null,null,"","","",null,"","","","","",""]
[null,null,null,null,null,null,null,null,null,null,null,null,null,null,null,null,null,null,null,null,null,null,null,null,null,null,"",{"$f":"IF(Y164=\"\",\"\",SUMIF(Data[Konstruktion],'Unikke lister'!Y164,Data[Vægt]))","v":""},{"$f":"IF(Y164=\"\",\"\",SUMIF(Data[Konstruktion],'Unikke lister'!Y164,Data[GWP sum]))","v":""},null,"","","","","","",null,null,null,null,"","",null,null,null,null,"","","",null,"","","","","",""]
[null,null,null,null,null,null,null,null,null,null,null,null,null,null,null,null,null,null,null,null,null,null,null,null,null,null,"",{"$f":"IF(Y165=\"\",\"\",SUMIF(Data[Konstruktion],'Unikke lister'!Y165,Data[Vægt]))","v":""},{"$f":"IF(Y165=\"\",\"\",SUMIF(Data[Konstruktion],'Unikke lister'!Y165,Data[GWP sum]))","v":""},null,"","","","","","",null,null,null,null,"","",null,null,null,null,"","","",null,"","","","","",""]
[null,null,null,null,null,null,null,null,null,null,null,null,null,null,null,null,null,null,null,null,null,null,null,null,null,null,"",{"$f":"IF(Y166=\"\",\"\",SUMIF(Data[Konstruktion],'Unikke lister'!Y166,Data[Vægt]))","v":""},{"$f":"IF(Y166=\"\",\"\",SUMIF(Data[Konstruktion],'Unikke lister'!Y166,Data[GWP sum]))","v":""},null,"","","","","","",null,null,null,null,"","",null,null,null,null,"","","",null,"","","","","",""]
[null,null,null,null,null,null,null,null,null,null,null,null,null,null,null,null,null,null,null,null,null,null,null,null,null,null,"",{"$f":"IF(Y167=\"\",\"\",SUMIF(Data[Konstruktion],'Unikke lister'!Y167,Data[Vægt]))","v":""},{"$f":"IF(Y167=\"\",\"\",SUMIF(Data[Konstruktion],'Unikke lister'!Y167,Data[GWP sum]))","v":""},null,"","","","","","",null,null,null,null,"","",null,null,null,null,"","","",null,"","","","","",""]
[null,null,null,null,null,null,null,null,null,null,null,null,null,null,null,null,null,null,null,null,null,null,null,null,null,null,"",{"$f":"IF(Y168=\"\",\"\",SUMIF(Data[Konstruktion],'Unikke lister'!Y168,Data[Vægt]))","v":""},{"$f":"IF(Y168=\"\",\"\",SUMIF(Data[Konstruktion],'Unikke lister'!Y168,Data[GWP sum]))","v":""},null,"","","","","","",null,null,null,null,"","",null,null,null,null,"","","",null,"","","","","",""]
[null,null,null,null,null,null,null,null,null,null,null,null,null,null,null,null,null,null,null,null,null,null,null,null,null,null,"",{"$f":"IF(Y169=\"\",\"\",SUMIF(Data[Konstruktion],'Unikke lister'!Y169,Data[Vægt]))","v":""},{"$f":"IF(Y169=\"\",\"\",SUMIF(Data[Konstruktion],'Unikke lister'!Y169,Data[GWP sum]))","v":""},null,"","","","","","",null,null,null,null,"","",null,null,null,null,"","","",null,"","","","","",""]
[null,null,null,null,null,null,null,null,null,null,null,null,null,null,null,null,null,null,null,null,null,null,null,null,null,null,"",{"$f":"IF(Y170=\"\",\"\",SUMIF(Data[Konstruktion],'Unikke lister'!Y170,Data[Vægt]))","v":""},{"$f":"IF(Y170=\"\",\"\",SUMIF(Data[Konstruktion],'Unikke lister'!Y170,Data[GWP sum]))","v":""},null,"","","","","","",null,null,null,null,"","",null,null,null,null,"","","",null,"","","","","",""]
[null,null,null,null,null,null,null,null,null,null,null,null,null,null,null,null,null,null,null,null,null,null,null,null,null,null,"",{"$f":"IF(Y171=\"\",\"\",SUMIF(Data[Konstruktion],'Unikke lister'!Y171,Data[Vægt]))","v":""},{"$f":"IF(Y171=\"\",\"\",SUMIF(Data[Konstruktion],'Unikke lister'!Y171,Data[GWP sum]))","v":""},null,"","","","","","",null,null,null,null,"","",null,null,null,null,"","","",null,"","","","","",""]
[null,null,null,null,null,null,null,null,null,null,null,null,null,null,null,null,null,null,null,null,null,null,null,null,null,null,"",{"$f":"IF(Y172=\"\",\"\",SUMIF(Data[Konstruktion],'Unikke lister'!Y172,Data[Vægt]))","v":""},{"$f":"IF(Y172=\"\",\"\",SUMIF(Data[Konstruktion],'Unikke lister'!Y172,Data[GWP sum]))","v":""},null,"","","","","","",null,null,null,null,"","",null,null,null,null,"","","",null,"","","","","",""]
[null,null,null,null,null,null,null,null,null,null,null,null,null,null,null,null,null,null,null,null,null,null,null,null,null,null,"",{"$f":"IF(Y173=\"\",\"\",SUMIF(Data[Konstruktion],'Unikke lister'!Y173,Data[Vægt]))","v":""},{"$f":"IF(Y173=\"\",\"\",SUMIF(Data[Konstruktion],'Unikke lister'!Y173,Data[GWP sum]))","v":""},null,"","","","","","",null,null,null,null,"","",null,null,null,null,"","","",null,"","","","","",""]
[null,null,null,null,null,null,null,null,null,null,null,null,null,null,null,null,null,null,null,null,null,null,null,null,null,null,"",{"$f":"IF(Y174=\"\",\"\",SUMIF(Data[Konstruktion],'Unikke lister'!Y174,Data[Vægt]))","v":""},{"$f":"IF(Y174=\"\",\"\",SUMIF(Data[Konstruktion],'Unikke lister'!Y174,Data[GWP sum]))","v":""},null,"","","","","","",null,null,null,null,"","",null,null,null,null,"","","",null,"","","","","",""]
[null,null,null,null,null,null,null,null,null,null,null,null,null,null,null,null,null,null,null,null,null,null,null,null,null,null,"",{"$f":"IF(Y175=\"\",\"\",SUMIF(Data[Konstruktion],'Unikke lister'!Y175,Data[Vægt]))","v":""},{"$f":"IF(Y175=\"\",\"\",SUMIF(Data[Konstruktion],'Unikke lister'!Y175,Data[GWP sum]))","v":""},null,"","","","","","",null,null,null,null,"","",null,null,null,null,"","","",null,"","","","","",""]
[null,null,null,null,null,null,null,null,null,null,null,null,null,null,null,null,null,null,null,null,null,null,null,null,null,null,"",{"$f":"IF(Y176=\"\",\"\",SUMIF(Data[Konstruktion],'Unikke lister'!Y176,Data[Vægt]))","v":""},{"$f":"IF(Y176=\"\",\"\",SUMIF(Data[Konstruktion],'Unikke lister'!Y176,Data[GWP sum]))","v":""},null,"","","","","","",null,null,null,null,"","",null,null,null,null,"","","",null,"","","","","",""]
[null,null,null,null,null,null,null,null,null,null,null,null,null,null,null,null,null,null,null,null,null,null,null,null,null,null,"",{"$f":"IF(Y177=\"\",\"\",SUMIF(Data[Konstruktion],'Unikke lister'!Y177,Data[Vægt]))","v":""},{"$f":"IF(Y177=\"\",\"\",SUMIF(Data[Konstruktion],'Unikke lister'!Y177,Data[GWP sum]))","v":""},null,"","","","","","",null,null,null,null,"","",null,null,null,null,"","","",null,"","","","","",""]
[null,null,null,null,null,null,null,null,null,null,null,null,null,null,null,null,null,null,null,null,null,null,null,null,null,null,"",{"$f":"IF(Y178=\"\",\"\",SUMIF(Data[Konstruktion],'Unikke lister'!Y178,Data[Vægt]))","v":""},{"$f":"IF(Y178=\"\",\"\",SUMIF(Data[Konstruktion],'Unikke lister'!Y178,Data[GWP sum]))","v":""},null,"","","","","","",null,null,null,null,"","",null,null,null,null,"","","",null,"","","","","",""]
[null,null,null,null,null,null,null,null,null,null,null,null,null,null,null,null,null,null,null,null,null,null,null,null,null,null,"",{"$f":"IF(Y179=\"\",\"\",SUMIF(Data[Konstruktion],'Unikke lister'!Y179,Data[Vægt]))","v":""},{"$f":"IF(Y179=\"\",\"\",SUMIF(Data[Konstruktion],'Unikke lister'!Y179,Data[GWP sum]))","v":""},null,"","","","","","",null,null,null,null,"","",null,null,null,null,"","","",null,"","","","","",""]
[null,null,null,null,null,null,null,null,null,null,null,null,null,null,null,null,null,null,null,null,null,null,null,null,null,null,"",{"$f":"IF(Y180=\"\",\"\",SUMIF(Data[Konstruktion],'Unikke lister'!Y180,Data[Vægt]))","v":""},{"$f":"IF(Y180=\"\",\"\",SUMIF(Data[Konstruktion],'Unikke lister'!Y180,Data[GWP sum]))","v":""},null,"","","","","","",null,null,null,null,"","",null,null,null,null,"","","",null,"","","","","",""]
[null,null,null,null,null,null,null,null,null,null,null,null,null,null,null,null,null,null,null,null,null,null,null,null,null,null,"",{"$f":"IF(Y181=\"\",\"\",SUMIF(Data[Konstruktion],'Unikke lister'!Y181,Data[Vægt]))","v":""},{"$f":"IF(Y181=\"\",\"\",SUMIF(Data[Konstruktion],'Unikke lister'!Y181,Data[GWP sum]))","v":""},null,"","","","","","",null,null,null,null,"","",null,null,null,null,"","","",null,"","","","","",""]
[null,null,null,null,null,null,null,null,null,null,null,null,null,null,null,null,null,null,null,null,null,null,null,null,null,null,"",{"$f":"IF(Y182=\"\",\"\",SUMIF(Data[Konstruktion],'Unikke lister'!Y182,Data[Vægt]))","v":""},{"$f":"IF(Y182=\"\",\"\",SUMIF(Data[Konstruktion],'Unikke lister'!Y182,Data[GWP sum]))","v":""},null,"","","","","","",null,null,null,null,"","",null,null,null,null,"","","",null,"","","","","",""]
[null,null,null,null,null,null,null,null,null,null,null,null,null,null,null,null,null,null,null,null,null,null,null,null,null,null,"",{"$f":"IF(Y183=\"\",\"\",SUMIF(Data[Konstruktion],'Unikke lister'!Y183,Data[Vægt]))","v":""},{"$f":"IF(Y183=\"\",\"\",SUMIF(Data[Konstruktion],'Unikke lister'!Y183,Data[GWP sum]))","v":""},null,"","","","","","",null,null,null,null,"","",null,null,null,null,"","","",null,"","","","","",""]
[null,null,null,null,null,null,null,null,null,null,null,null,null,null,null,null,null,null,null,null,null,null,null,null,null,null,"",{"$f":"IF(Y184=\"\",\"\",SUMIF(Data[Konstruktion],'Unikke lister'!Y184,Data[Vægt]))","v":""},{"$f":"IF(Y184=\"\",\"\",SUMIF(Data[Konstruktion],'Unikke lister'!Y184,Data[GWP sum]))","v":""},null,"","","","","","",null,null,null,null,"","",null,null,null,null,"","","",null,"","","","","",""]
[null,null,null,null,null,null,null,null,null,null,null,null,null,null,null,null,null,null,null,null,null,null,null,null,null,null,"",{"$f":"IF(Y185=\"\",\"\",SUMIF(Data[Konstruktion],'Unikke lister'!Y185,Data[Vægt]))","v":""},{"$f":"IF(Y185=\"\",\"\",SUMIF(Data[Konstruktion],'Unikke lister'!Y185,Data[GWP sum]))","v":""},null,"","","","","","",null,null,null,null,"","",null,null,null,null,"","","",null,"","","","","",""]
[null,null,null,null,null,null,null,null,null,null,null,null,null,null,null,null,null,null,null,null,null,null,null,null,null,null,"",{"$f":"IF(Y186=\"\",\"\",SUMIF(Data[Konstruktion],'Unikke lister'!Y186,Data[Vægt]))","v":""},{"$f":"IF(Y186=\"\",\"\",SUMIF(Data[Konstruktion],'Unikke lister'!Y186,Data[GWP sum]))","v":""},null,"","","","","","",null,null,null,null,"","",null,null,null,null,"","","",null,"","","","","",""]
[null,null,null,null,null,null,null,null,null,null,null,null,null,null,null,null,null,null,null,null,null,null,null,null,null,null,"",{"$f":"IF(Y187=\"\",\"\",SUMIF(Data[Konstruktion],'Unikke lister'!Y187,Data[Vægt]))","v":""},{"$f":"IF(Y187=\"\",\"\",SUMIF(Data[Konstruktion],'Unikke lister'!Y187,Data[GWP sum]))","v":""},null,"","","","","","",null,null,null,null,"","",null,null,null,null,"","","",null,"","","","","",""]
[null,null,null,null,null,null,null,null,null,null,null,null,null,null,null,null,null,null,null,null,null,null,null,null,null,null,"",{"$f":"IF(Y188=\"\",\"\",SUMIF(Data[Konstruktion],'Unikke lister'!Y188,Data[Vægt]))","v":""},{"$f":"IF(Y188=\"\",\"\",SUMIF(Data[Konstruktion],'Unikke lister'!Y188,Data[GWP sum]))","v":""},null,"","","","","","",null,null,null,null,"","",null,null,null,null,"","","",null,"","","","","",""]
[null,null,null,null,null,null,null,null,null,null,null,null,null,null,null,null,null,null,null,null,null,null,null,null,null,null,"",{"$f":"IF(Y189=\"\",\"\",SUMIF(Data[Konstruktion],'Unikke lister'!Y189,Data[Vægt]))","v":""},{"$f":"IF(Y189=\"\",\"\",SUMIF(Data[Konstruktion],'Unikke lister'!Y189,Data[GWP sum]))","v":""},null,"","","","","","",null,null,null,null,"","",null,null,null,null,"","","",null,"","","","","",""]
[null,null,null,null,null,null,null,null,null,null,null,null,null,null,null,null,null,null,null,null,null,null,null,null,null,null,"",{"$f":"IF(Y190=\"\",\"\",SUMIF(Data[Konstruktion],'Unikke lister'!Y190,Data[Vægt]))","v":""},{"$f":"IF(Y190=\"\",\"\",SUMIF(Data[Konstruktion],'Unikke lister'!Y190,Data[GWP sum]))","v":""},null,"","","","","","",null,null,null,null,"","",null,null,null,null,"","","",null,"","","","","",""]
[null,null,null,null,null,null,null,null,null,null,null,null,null,null,null,null,null,null,null,null,null,null,null,null,null,null,"",{"$f":"IF(Y191=\"\",\"\",SUMIF(Data[Konstruktion],'Unikke lister'!Y191,Data[Vægt]))","v":""},{"$f":"IF(Y191=\"\",\"\",SUMIF(Data[Konstruktion],'Unikke lister'!Y191,Data[GWP sum]))","v":""},null,"","","","","","",null,null,null,null,"","",null,null,null,null,"","","",null,"","","","","",""]
[null,null,null,null,null,null,null,null,null,null,null,null,null,null,null,null,null,null,null,null,null,null,null,null,null,null,"",{"$f":"IF(Y192=\"\",\"\",SUMIF(Data[Konstruktion],'Unikke lister'!Y192,Data[Vægt]))","v":""},{"$f":"IF(Y192=\"\",\"\",SUMIF(Data[Konstruktion],'Unikke lister'!Y192,Data[GWP sum]))","v":""},null,"","","","","","",null,null,null,null,"","",null,null,null,null,"","","",null,"","","","","",""]
[null,null,null,null,null,null,null,null,null,null,null,null,null,null,null,null,null,null,null,null,null,null,null,null,null,null,"",{"$f":"IF(Y193=\"\",\"\",SUMIF(Data[Konstruktion],'Unikke lister'!Y193,Data[Vægt]))","v":""},{"$f":"IF(Y193=\"\",\"\",SUMIF(Data[Konstruktion],'Unikke lister'!Y193,Data[GWP sum]))","v":""},null,"","","","","","",null,null,null,null,"","",null,null,null,null,"","","",null,"","","","","",""]
[null,null,null,null,null,null,null,null,null,null,null,null,null,null,null,null,null,null,null,null,null,null,null,null,null,null,"",{"$f":"IF(Y194=\"\",\"\",SUMIF(Data[Konstruktion],'Unikke lister'!Y194,Data[Vægt]))","v":""},{"$f":"IF(Y194=\"\",\"\",SUMIF(Data[Konstruktion],'Unikke lister'!Y194,Data[GWP sum]))","v":""},null,"","","","","","",null,null,null,null,"","",null,null,null,null,"","","",null,"","","","","",""]
[null,null,null,null,null,null,null,null,null,null,null,null,null,null,null,null,null,null,null,null,null,null,null,null,null,null,"",{"$f":"IF(Y195=\"\",\"\",SUMIF(Data[Konstruktion],'Unikke lister'!Y195,Data[Vægt]))","v":""},{"$f":"IF(Y195=\"\",\"\",SUMIF(Data[Konstruktion],'Unikke lister'!Y195,Data[GWP sum]))","v":""},null,"","","","","","",null,null,null,null,"","",null,null,null,null,"","","",null,"","","","","",""]
[null,null,null,null,null,null,null,null,null,null,null,null,null,null,null,null,null,null,null,null,null,null,null,null,null,null,{"$f":"IF(Y196=\"\",\"\",IF(Z196=\"\",Y196,Z196))","v":""},{"$f":"IF(Y196=\"\",\"\",SUMIF(Data[Konstruktion],'Unikke lister'!Y196,Data[Vægt]))","v":""},{"$f":"IF(Y196=\"\",\"\",SUMIF(Data[Konstruktion],'Unikke lister'!Y196,Data[GWP sum]))","v":""},null,"","","","","","",null,null,null,null,"","",null,null,null,null,"","","",null,"","","","","",""]
[null,null,null,null,null,null,null,null,null,null,null,null,null,null,null,null,null,null,null,null,null,null,null,null,null,null,"",{"$f":"IF(Y197=\"\",\"\",SUMIF(Data[Konstruktion],'Unikke lister'!Y197,Data[Vægt]))","v":""},{"$f":"IF(Y197=\"\",\"\",SUMIF(Data[Konstruktion],'Unikke lister'!Y197,Data[GWP sum]))","v":""},null,{"$f":"IF(AD197=\"\",\"\",SUMIF($AA$4:$AA$200,AD197,$AB$4:$AB$200))","v":""},{"$f":"IF(AD197=\"\",\"\",AE197/$AE$3)","v":""},{"$f":"IF(AD197=\"\",\"\",_xlfn.RANK.EQ(AE197,$AE$4:$AE$200,0))","v":""},{"$f":"IF(AD197=\"\",\"\",SUMIF($AA$4:$AA$200,AD197,$AC$4:$AC$200))","v":""},{"$f":"IF(AD197=\"\",\"\",AH197/$AH$3)","v":""},{"$f":"IF(AD197=\"\",\"\",_xlfn.RANK.EQ(AH197,$AH$4:$AH$200,0))","v":""},null,null,null,null,{"$f":"IF(AN197=\"\",\"\",IFERROR(MATCH(AN197,$AD$4:$AD$1000,0),_xlfn.XLOOKUP(AN197,$Y$4:$Y$1000,$AA$4:$AA$1000,\"\",0)))","v":""},"",null,null,null,null,{"$f":"IF(AS197=\"\",\"\",IF(AT197=\"\",AS197,AT197))","v":""},{"$f":"IF(AS197=\"\",\"\",SUMIF($AP$4:$AP$1000,AS197,$AQ$4:$AQ$1000))","v":""},{"$f":"IF(AS197=\"\",\"\",SUMIF($AP$4:$AP$1000,AS197,$AR$4:$AR$1000))","v":""},null,{"$f":"IF(AX197=\"\",\"\",SUMIF($AU$4:$AU$300,AX197,$AV$4:$AV$300))","v":""},{"$f":"IF(AX197=\"\",\"\",AY197/$AY$3)","v":""},{"$f":"IF(AX197=\"\",\"\",_xlfn.RANK.EQ(AY197,$AY$4:$AY$300,0))","v":""},{"$f":"IF(AX197=\"\",\"\",SUMIF($AU$4:$AU$300,AX197,$AW$4:$AW$300))","v":""},{"$f":"IF(AX197=\"\",\"\",BB197/$BB$3)","v":""},{"$f":"IF(AX197=\"\",\"\",_xlfn.RANK.EQ(BB197,$BB$4:$BB$300,0))","v":""}]
[null,null,null,null,null,null,null,null,null,null,null,null,null,null,null,null,null,null,null,null,null,null,null,null,null,null,"",{"$f":"IF(Y198=\"\",\"\",SUMIF(Data[Konstruktion],'Unikke lister'!Y198,Data[Vægt]))","v":""},{"$f":"IF(Y198=\"\",\"\",SUMIF(Data[Konstruktion],'Unikke lister'!Y198,Data[GWP sum]))","v":""},null,"","","","","","",null,null,null,null,"","",null,null,null,null,"","","",null,"","","","","",""]
[null,null,null,null,null,null,null,null,null,null,null,null,null,null,null,null,null,null,null,null,null,null,null,null,null,null,"",{"$f":"IF(Y199=\"\",\"\",SUMIF(Data[Konstruktion],'Unikke lister'!Y199,Data[Vægt]))","v":""},{"$f":"IF(Y199=\"\",\"\",SUMIF(Data[Konstruktion],'Unikke lister'!Y199,Data[GWP sum]))","v":""},null,"","","","","","",null,null,null,null,"","",null,null,null,null,"","","",null,"",{"$f":"IF(AX199=\"\",\"\",AY199/$AY$3)","v":""},{"$f":"IF(AX199=\"\",\"\",_xlfn.RANK.EQ(AY199,$AY$4:$AY$300,0))","v":""},{"$f":"IF(AX199=\"\",\"\",SUMIF($AU$4:$AU$300,AX199,$AW$4:$AW$300))","v":""},{"$f":"IF(AX199=\"\",\"\",BB199/$BB$3)","v":""},{"$f":"IF(AX199=\"\",\"\",_xlfn.RANK.EQ(BB199,$BB$4:$BB$300,0))","v":""}]
[null,null,null,null,null,null,null,null,null,null,null,null,null,null,null,null,null,null,null,null,null,null,null,null,null,null,"",{"$f":"IF(Y200=\"\",\"\",SUMIF(Data[Konstruktion],'Unikke lister'!Y200,Data[Vægt]))","v":""},{"$f":"IF(Y200=\"\",\"\",SUMIF(Data[Konstruktion],'Unikke lister'!Y200,Data[GWP sum]))","v":""},null,"","","","","","",null,null,null,null,"","",null,null,null,null,"","","",null,"","","","","",""]
[null,null,null,null,null,null,null,null,null,null,null,null,null,null,null,null,null,null,null,null,null,null,null,null,null,null,null,null,null,null,null,null,null,null,null,null,null,null,null,null,"","",null,null,null,null,"","",{"$f":"IF(AS201=\"\",\"\",SUMIF($AP$4:$AP$1000,AS201,$AR$4:$AR$1000))","v":""},null,"","","","","",""]
[null,null,null,null,null,null,null,null,null,null,null,null,null,null,null,null,null,null,null,null,null,null,null,null,null,null,null,null,null,null,null,null,null,null,null,null,null,null,null,null,"","",null,null,null,null,"","",{"$f":"IF(AS202=\"\",\"\",SUMIF($AP$4:$AP$1000,AS202,$AR$4:$AR$1000))","v":""},null,"","","","","",""]
[null,null,null,null,null,null,null,null,null,null,null,null,null,null,null,null,null,null,null,null,null,null,null,null,null,null,null,null,null,null,null,null,null,null,null,null,null,null,null,null,"","",null,null,null,null,"","","",null,"","","","","",""]
[null,null,null,null,null,null,null,null,null,null,null,null,null,null,null,null,null,null,null,null,null,null,null,null,null,null,null,null,null,null,null,null,null,null,null,null,null,null,null,null,"","",null,null,null,null,"","","",null,"","","","","",""]
[null,null,null,null,null,null,null,null,null,null,null,null,null,null,null,null,null,null,null,null,null,null,null,null,null,null,null,null,null,null,null,null,null,null,null,null,null,null,null,null,"","",null,null,null,null,"","","",null,"","","","","",""]
[null,null,null,null,null,null,null,null,null,null,null,null,null,null,null,null,null,null,null,null,null,null,null,null,null,null,null,null,null,null,null,null,null,null,null,null,null,null,null,null,"","",null,null,null,null,"","","",null,"","","","","",""]
[null,null,null,null,null,null,null,null,null,null,null,null,null,null,null,null,null,null,null,null,null,null,null,null,null,null,null,null,null,null,null,null,null,null,null,null,null,null,null,null,"","",null,null,null,null,"","","",null,"","","","","",""]
[null,null,null,null,null,null,null,null,null,null,null,null,null,null,null,null,null,null,null,null,null,null,null,null,null,null,null,null,null,null,null,null,null,null,null,null,null,null,null,null,"","",null,null,null,null,"","","",null,"","","","","",""]
[null,null,null,null,null,null,null,null,null,null,null,null,null,null,null,null,null,null,null,null,null,null,null,null,null,null,null,null,null,null,null,null,null,null,null,null,null,null,null,null,"","",null,null,null,null,"","","",null,"","","","","",""]
[null,null,null,null,null,null,null,null,null,null,null,null,null,null,null,null,null,null,null,null,null,null,null,null,null,null,null,null,null,null,null,null,null,null,null,null,null,null,null,null,"","",null,null,null,null,"","","",null,"","","","","",""]
[null,null,null,null,null,null,null,null,null,null,null,null,null,null,null,null,null,null,null,null,null,null,null,null,null,null,null,null,null,null,null,null,null,null,null,null,null,null,null,null,"","",null,null,null,null,"","","",null,"","","","","",""]
[null,null,null,null,null,null,null,null,null,null,null,null,null,null,null,null,null,null,null,null,null,null,null,null,null,null,null,null,null,null,null,null,null,null,null,null,null,null,null,null,"","",null,null,null,null,"","","",null,"","","","","",""]
[null,null,null,null,null,null,null,null,null,null,null,null,null,null,null,null,null,null,null,null,null,null,null,null,null,null,null,null,null,null,null,null,null,null,null,null,null,null,null,null,"","",null,null,null,null,"","","",null,"","","","","",""]
[null,null,null,null,null,null,null,null,null,null,null,null,null,null,null,null,null,null,null,null,null,null,null,null,null,null,null,null,null,null,null,null,null,null,null,null,null,null,null,null,"",{"$f":"IF(AN214=\"\",\"\",IF(N(AO214)=0,AO214,AM214))","v":""},null,null,null,null,"","","",null,"","","","","",""]
[null,null,null,null,null,null,null,null,null,null,null,null,null,null,null,null,null,null,null,null,null,null,null,null,null,null,null,null,null,null,null,null,null,null,null,null,null,null,null,null,"","",null,null,null,null,"","","",null,"","","","","",""]
[null,null,null,null,null,null,null,null,null,null,null,null,null,null,null,null,null,null,null,null,null,null,null,null,null,null,null,null,null,null,null,null,null,null,null,null,null,null,null,null,"","",null,null,null,null,"","","",null,"","","","","",""]
[null,null,null,null,null,null,null,null,null,null,null,null,null,null,null,null,null,null,null,null,null,null,null,null,null,null,null,null,null,null,null,null,null,null,null,null,null,null,null,null,"","",null,null,null,null,"","","",null,"","","","","",""]
[null,null,null,null,null,null,null,null,null,null,null,null,null,null,null,null,null,null,null,null,null,null,null,null,null,null,null,null,null,null,null,null,null,null,null,null,null,null,null,null,"","",null,null,null,null,"","","",null,"","","","","",""]
[null,null,null,null,null,null,null,null,null,null,null,null,null,null,null,null,null,null,null,null,null,null,null,null,null,null,null,null,null,null,null,null,null,null,null,null,null,null,null,null,"","",null,null,null,null,"","","",null,"","","","","",""]
[null,null,null,null,null,null,null,null,null,null,null,null,null,null,null,null,null,null,null,null,null,null,null,null,null,null,null,null,null,null,null,null,null,null,null,null,null,null,null,null,"","",null,null,null,null,"","","",null,"","","","","",""]
[null,null,null,null,null,null,null,null,null,null,null,null,null,null,null,null,null,null,null,null,null,null,null,null,null,null,null,null,null,null,null,null,null,null,null,null,null,null,null,null,"","",null,null,null,null,"","","",null,"","","","","",""]
[null,null,null,null,null,null,null,null,null,null,null,null,null,null,null,null,null,null,null,null,null,null,null,null,null,null,null,null,null,null,null,null,null,null,null,null,null,null,null,null,"","",null,null,null,null,"","","",null,"","","","","",""]
[null,null,null,null,null,null,null,null,null,null,null,null,null,null,null,null,null,null,null,null,null,null,null,null,null,null,null,null,null,null,null,null,null,null,null,null,null,null,null,null,"","",null,null,null,null,"","","",null,"","","","","",""]
[null,null,null,null,null,null,null,null,null,null,null,null,null,null,null,null,null,null,null,null,null,null,null,null,null,null,null,null,null,null,null,null,null,null,null,null,null,null,null,null,"","",null,null,null,null,"","","",null,"","","","","",""]
[null,null,null,null,null,null,null,null,null,null,null,null,null,null,null,null,null,null,null,null,null,null,null,null,null,null,null,null,null,null,null,null,null,null,null,null,null,null,null,null,"","",null,null,null,null,"","","",null,"","","","","",""]
[null,null,null,null,null,null,null,null,null,null,null,null,null,null,null,null,null,null,null,null,null,null,null,null,null,null,null,null,null,null,null,null,null,null,null,null,null,null,null,null,"","",null,null,null,null,"","","",null,"","","","","",""]
[null,null,null,null,null,null,null,null,null,null,null,null,null,null,null,null,null,null,null,null,null,null,null,null,null,null,null,null,null,null,null,null,null,null,null,null,null,null,null,null,"","",null,null,null,null,"","","",null,"","","","","",""]
[null,null,null,null,null,null,null,null,null,null,null,null,null,null,null,null,null,null,null,null,null,null,null,null,null,null,null,null,null,null,null,null,null,null,null,null,null,null,null,null,"","",null,null,null,null,"","","",null,"","","","","",""]
[null,null,null,null,null,null,null,null,null,null,null,null,null,null,null,null,null,null,null,null,null,null,null,null,null,null,null,null,null,null,null,null,null,null,null,null,null,null,null,null,"","",null,null,null,null,"","","",null,"","","","","",""]
[null,null,null,null,null,null,null,null,null,null,null,null,null,null,null,null,null,null,null,null,null,null,null,null,null,null,null,null,null,null,null,null,null,null,null,null,null,null,null,null,"","",null,null,null,null,"","","",null,"","","","","",""]
[null,null,null,null,null,null,null,null,null,null,null,null,null,null,null,null,null,null,null,null,null,null,null,null,null,null,null,null,null,null,null,null,null,null,null,null,null,null,null,null,"","",null,null,null,null,"","","",null,"","","","","",""]
[null,null,null,null,null,null,null,null,null,null,null,null,null,null,null,null,null,null,null,null,null,null,null,null,null,null,null,null,null,null,null,null,null,null,null,null,null,null,null,null,"","",null,null,null,null,"","","",null,"","","","","",""]
[null,null,null,null,null,null,null,null,null,null,null,null,null,null,null,null,null,null,null,null,null,null,null,null,null,null,null,null,null,null,null,null,null,null,null,null,null,null,null,null,"","",null,null,null,null,"","","",null,"","","","","",""]
[null,null,null,null,null,null,null,null,null,null,null,null,null,null,null,null,null,null,null,null,null,null,null,null,null,null,null,null,null,null,null,null,null,null,null,null,null,null,null,null,"","",null,null,null,null,"","","",null,"","","","","",""]
[null,null,null,null,null,null,null,null,null,null,null,null,null,null,null,null,null,null,null,null,null,null,null,null,null,null,null,null,null,null,null,null,null,null,null,null,null,null,null,null,"","",null,null,null,null,"","","",null,"","","","","",""]
[null,null,null,null,null,null,null,null,null,null,null,null,null,null,null,null,null,null,null,null,null,null,null,null,null,null,null,null,null,null,null,null,null,null,null,null,null,null,null,null,"","",null,null,null,null,"","","",null,"","","","","",""]
[null,null,null,null,null,null,null,null,null,null,null,null,null,null,null,null,null,null,null,null,null,null,null,null,null,null,null,null,null,null,null,null,null,null,null,null,null,null,null,null,"","",null,null,null,null,"","","",null,"","","","","",""]
[null,null,null,null,null,null,null,null,null,null,null,null,null,null,null,null,null,null,null,null,null,null,null,null,null,null,null,null,null,null,null,null,null,null,null,null,null,null,null,null,"","",null,null,null,null,"","","",null,"","","","","",""]
[null,null,null,null,null,null,null,null,null,null,null,null,null,null,null,null,null,null,null,null,null,null,null,null,null,null,null,null,null,null,null,null,null,null,null,null,null,null,null,null,"","",null,null,null,null,"","","",null,"","","","","",""]
[null,null,null,null,null,null,null,null,null,null,null,null,null,null,null,null,null,null,null,null,null,null,null,null,null,null,null,null,null,null,null,null,null,null,null,null,null,null,null,null,"","",null,null,null,null,"","","",null,"","","","","",""]
[null,null,null,null,null,null,null,null,null,null,null,null,null,null,null,null,null,null,null,null,null,null,null,null,null,null,null,null,null,null,null,null,null,null,null,null,null,null,null,null,"","",null,null,null,null,"","","",null,"","","","","",""]
[null,null,null,null,null,null,null,null,null,null,null,null,null,null,null,null,null,null,null,null,null,null,null,null,null,null,null,null,null,null,null,null,null,null,null,null,null,null,null,null,"","",null,null,null,null,"","","",null,"","","","","",""]
[null,null,null,null,null,null,null,null,null,null,null,null,null,null,null,null,null,null,null,null,null,null,null,null,null,null,null,null,null,null,null,null,null,null,null,null,null,null,null,null,"","",null,null,null,null,"","","",null,"","","","","",""]
[null,null,null,null,null,null,null,null,null,null,null,null,null,null,null,null,null,null,null,null,null,null,null,null,null,null,null,null,null,null,null,null,null,null,null,null,null,null,null,null,"","",null,null,null,null,"","","",null,"","","","","",""]
[null,null,null,null,null,null,null,null,null,null,null,null,null,null,null,null,null,null,null,null,null,null,null,null,null,null,null,null,null,null,null,null,null,null,null,null,null,null,null,null,"","",null,null,null,null,"","","",null,"","","","","",""]
[null,null,null,null,null,null,null,null,null,null,null,null,null,null,null,null,null,null,null,null,null,null,null,null,null,null,null,null,null,null,null,null,null,null,null,null,null,null,null,null,"","",null,null,null,null,"","","",null,"","","","","",""]
[null,null,null,null,null,null,null,null,null,null,null,null,null,null,null,null,null,null,null,null,null,null,null,null,null,null,null,null,null,null,null,null,null,null,null,null,null,null,null,null,"","",null,null,null,null,"","","",null,"","","","","",""]
[null,null,null,null,null,null,null,null,null,null,null,null,null,null,null,null,null,null,null,null,null,null,null,null,null,null,null,null,null,null,null,null,null,null,null,null,null,null,null,null,"","",null,null,null,null,"","","",null,"","","","","",""]
[null,null,null,null,null,null,null,null,null,null,null,null,null,null,null,null,null,null,null,null,null,null,null,null,null,null,null,null,null,null,null,null,null,null,null,null,null,null,null,null,"","",null,null,null,null,"","","",null,"","","","","",""]
[null,null,null,null,null,null,null,null,null,null,null,null,null,null,null,null,null,null,null,null,null,null,null,null,null,null,null,null,null,null,null,null,null,null,null,null,null,null,null,null,"","",null,null,null,null,"","","",null,"","","","","",""]
[null,null,null,null,null,null,null,null,null,null,null,null,null,null,null,null,null,null,null,null,null,null,null,null,null,null,null,null,null,null,null,null,null,null,null,null,null,null,null,null,"","",null,null,null,null,"","","",null,"","","","","",""]
[null,null,null,null,null,null,null,null,null,null,null,null,null,null,null,null,null,null,null,null,null,null,null,null,null,null,null,null,null,null,null,null,null,null,null,null,null,null,null,null,"","",null,null,null,null,"","","",null,"","","","","",""]
[null,null,null,null,null,null,null,null,null,null,null,null,null,null,null,null,null,null,null,null,null,null,null,null,null,null,null,null,null,null,null,null,null,null,null,null,null,null,null,null,"","",null,null,null,null,"","","",null,"","","","","",""]
[null,null,null,null,null,null,null,null,null,null,null,null,null,null,null,null,null,null,null,null,null,null,null,null,null,null,null,null,null,null,null,null,null,null,null,null,null,null,null,null,"","",null,null,null,null,"","","",null,"","","","","",""]
[null,null,null,null,null,null,null,null,null,null,null,null,null,null,null,null,null,null,null,null,null,null,null,null,null,null,null,null,null,null,null,null,null,null,null,null,null,null,null,null,"","",null,null,null,null,"","","",null,"","","","","",""]
[null,null,null,null,null,null,null,null,null,null,null,null,null,null,null,null,null,null,null,null,null,null,null,null,null,null,null,null,null,null,null,null,null,null,null,null,null,null,null,null,"","",null,null,null,null,"","","",null,"","","","","",""]
[null,null,null,null,null,null,null,null,null,null,null,null,null,null,null,null,null,null,null,null,null,null,null,null,null,null,null,null,null,null,null,null,null,null,null,null,null,null,null,null,"","",null,null,null,null,"","","",null,"","","","","",""]
[null,null,null,null,null,null,null,null,null,null,null,null,null,null,null,null,null,null,null,null,null,null,null,null,null,null,null,null,null,null,null,null,null,null,null,null,null,null,null,null,"","",null,null,null,null,"","","",null,"","","","","",""]
[null,null,null,null,null,null,null,null,null,null,null,null,null,null,null,null,null,null,null,null,null,null,null,null,null,null,null,null,null,null,null,null,null,null,null,null,null,null,null,null,"","",null,null,null,null,"","","",null,"","","","","",""]
[null,null,null,null,null,null,null,null,null,null,null,null,null,null,null,null,null,null,null,null,null,null,null,null,null,null,null,null,null,null,null,null,null,null,null,null,null,null,null,null,"","",null,null,null,null,"","","",null,"","","","","",""]
[null,null,null,null,null,null,null,null,null,null,null,null,null,null,null,null,null,null,null,null,null,null,null,null,null,null,null,null,null,null,null,null,null,null,null,null,null,null,null,null,{"$f":"IF(AN261=\"\",\"\",IFERROR(MATCH(AN261,$AD$4:$AD$1000,0),_xlfn.XLOOKUP(AN261,$Y$4:$Y$1000,$AA$4:$AA$1000,\"\",0)))","v":""},"",null,null,null,null,{"$f":"IF(AS261=\"\",\"\",IF(AT261=\"\",AS261,AT261))","v":""},{"$f":"IF(AS261=\"\",\"\",SUMIF($AP$4:$AP$1000,AS261,$AQ$4:$AQ$1000))","v":""},"",null,{"$f":"IF(AX261=\"\",\"\",SUMIF($AU$4:$AU$300,AX261,$AV$4:$AV$300))","v":""},"","","","",""]
[null,null,null,null,null,null,null,null,null,null,null,null,null,null,null,null,null,null,null,null,null,null,null,null,null,null,null,null,null,null,null,null,null,null,null,null,null,null,null,null,"","",null,null,null,null,"","","",null,"","","","","",""]
[null,null,null,null,null,null,null,null,null,null,null,null,null,null,null,null,null,null,null,null,null,null,null,null,null,null,null,null,null,null,null,null,null,null,null,null,null,null,null,null,"","",null,null,null,null,"","","",null,"",{"$f":"IF(AX263=\"\",\"\",AY263/$AY$3)","v":""},{"$f":"IF(AX263=\"\",\"\",_xlfn.RANK.EQ(AY263,$AY$4:$AY$300,0))","v":""},{"$f":"IF(AX263=\"\",\"\",SUMIF($AU$4:$AU$300,AX263,$AW$4:$AW$300))","v":""},{"$f":"IF(AX263=\"\",\"\",BB263/$BB$3)","v":""},{"$f":"IF(AX263=\"\",\"\",_xlfn.RANK.EQ(BB263,$BB$4:$BB$300,0))","v":""}]
[null,null,null,null,null,null,null,null,null,null,null,null,null,null,null,null,null,null,null,null,null,null,null,null,null,null,null,null,null,null,null,null,null,null,null,null,null,null,null,null,"","",null,null,null,null,"","","",null,"","","","","",""]
[null,null,null,null,null,null,null,null,null,null,null,null,null,null,null,null,null,null,null,null,null,null,null,null,null,null,null,null,null,null,null,null,null,null,null,null,null,null,null,null,"","",null,null,null,null,"","","",null,"","","","","",""]
[null,null,null,null,null,null,null,null,null,null,null,null,null,null,null,null,null,null,null,null,null,null,null,null,null,null,null,null,null,null,null,null,null,null,null,null,null,null,null,null,"","",null,null,null,null,"","",{"$f":"IF(AS266=\"\",\"\",SUMIF($AP$4:$AP$1000,AS266,$AR$4:$AR$1000))","v":""},null,"","","","","",""]
[null,null,null,null,null,null,null,null,null,null,null,null,null,null,null,null,null,null,null,null,null,null,null,null,null,null,null,null,null,null,null,null,null,null,null,null,null,null,null,null,"","",null,null,null,null,"","","",null,"","","","","",""]
[null,null,null,null,null,null,null,null,null,null,null,null,null,null,null,null,null,null,null,null,null,null,null,null,null,null,null,null,null,null,null,null,null,null,null,null,null,null,null,null,"","",null,null,null,null,"","","",null,"","","","","",""]
[null,null,null,null,null,null,null,null,null,null,null,null,null,null,null,null,null,null,null,null,null,null,null,null,null,null,null,null,null,null,null,null,null,null,null,null,null,null,null,null,"","",null,null,null,null,"","","",null,"","","","","",""]
[null,null,null,null,null,null,null,null,null,null,null,null,null,null,null,null,null,null,null,null,null,null,null,null,null,null,null,null,null,null,null,null,null,null,null,null,null,null,null,null,"","",null,null,null,null,"","","",null,"","","","","",""]
[null,null,null,null,null,null,null,null,null,null,null,null,null,null,null,null,null,null,null,null,null,null,null,null,null,null,null,null,null,null,null,null,null,null,null,null,null,null,null,null,"","",null,null,null,null,"","","",null,"","","","","",""]
[null,null,null,null,null,null,null,null,null,null,null,null,null,null,null,null,null,null,null,null,null,null,null,null,null,null,null,null,null,null,null,null,null,null,null,null,null,null,null,null,"","",null,null,null,null,"","","",null,"","","","","",""]
[null,null,null,null,null,null,null,null,null,null,null,null,null,null,null,null,null,null,null,null,null,null,null,null,null,null,null,null,null,null,null,null,null,null,null,null,null,null,null,null,"","",null,null,null,null,"","","",null,"","","","","",""]
[null,null,null,null,null,null,null,null,null,null,null,null,null,null,null,null,null,null,null,null,null,null,null,null,null,null,null,null,null,null,null,null,null,null,null,null,null,null,null,null,"","",null,null,null,null,"","","",null,"","","","","",""]
[null,null,null,null,null,null,null,null,null,null,null,null,null,null,null,null,null,null,null,null,null,null,null,null,null,null,null,null,null,null,null,null,null,null,null,null,null,null,null,null,"","",null,null,null,null,"","","",null,"","","","","",""]
[null,null,null,null,null,null,null,null,null,null,null,null,null,null,null,null,null,null,null,null,null,null,null,null,null,null,null,null,null,null,null,null,null,null,null,null,null,null,null,null,"","",null,null,null,null,"","","",null,"","","","","",""]
[null,null,null,null,null,null,null,null,null,null,null,null,null,null,null,null,null,null,null,null,null,null,null,null,null,null,null,null,null,null,null,null,null,null,null,null,null,null,null,null,"","",null,null,null,null,"","","",null,"","","","","",""]
[null,null,null,null,null,null,null,null,null,null,null,null,null,null,null,null,null,null,null,null,null,null,null,null,null,null,null,null,null,null,null,null,null,null,null,null,null,null,null,null,"",{"$f":"IF(AN278=\"\",\"\",IF(N(AO278)=0,AO278,AM278))","v":""},null,null,null,null,"","","",null,"","","","","",""]
[null,null,null,null,null,null,null,null,null,null,null,null,null,null,null,null,null,null,null,null,null,null,null,null,null,null,null,null,null,null,null,null,null,null,null,null,null,null,null,null,"","",null,null,null,null,"","","",null,"","","","","",""]
[null,null,null,null,null,null,null,null,null,null,null,null,null,null,null,null,null,null,null,null,null,null,null,null,null,null,null,null,null,null,null,null,null,null,null,null,null,null,null,null,"","",null,null,null,null,"","","",null,"","","","","",""]
[null,null,null,null,null,null,null,null,null,null,null,null,null,null,null,null,null,null,null,null,null,null,null,null,null,null,null,null,null,null,null,null,null,null,null,null,null,null,null,null,"","",null,null,null,null,"","","",null,"","","","","",""]
[null,null,null,null,null,null,null,null,null,null,null,null,null,null,null,null,null,null,null,null,null,null,null,null,null,null,null,null,null,null,null,null,null,null,null,null,null,null,null,null,"","",null,null,null,null,"","","",null,"","","","","",""]
[null,null,null,null,null,null,null,null,null,null,null,null,null,null,null,null,null,null,null,null,null,null,null,null,null,null,null,null,null,null,null,null,null,null,null,null,null,null,null,null,"","",null,null,null,null,"","","",null,"","","","","",""]
[null,null,null,null,null,null,null,null,null,null,null,null,null,null,null,null,null,null,null,null,null,null,null,null,null,null,null,null,null,null,null,null,null,null,null,null,null,null,null,null,"","",null,null,null,null,"","","",null,"","","","","",""]
[null,null,null,null,null,null,null,null,null,null,null,null,null,null,null,null,null,null,null,null,null,null,null,null,null,null,null,null,null,null,null,null,null,null,null,null,null,null,null,null,"","",null,null,null,null,"","","",null,"","","","","",""]
[null,null,null,null,null,null,null,null,null,null,null,null,null,null,null,null,null,null,null,null,null,null,null,null,null,null,null,null,null,null,null,null,null,null,null,null,null,null,null,null,"","",null,null,null,null,"","","",null,"","","","","",""]
[null,null,null,null,null,null,null,null,null,null,null,null,null,null,null,null,null,null,null,null,null,null,null,null,null,null,null,null,null,null,null,null,null,null,null,null,null,null,null,null,"","",null,null,null,null,"","","",null,"","","","","",""]
[null,null,null,null,null,null,null,null,null,null,null,null,null,null,null,null,null,null,null,null,null,null,null,null,null,null,null,null,null,null,null,null,null,null,null,null,null,null,null,null,"","",null,null,null,null,"","","",null,"","","","","",""]
[null,null,null,null,null,null,null,null,null,null,null,null,null,null,null,null,null,null,null,null,null,null,null,null,null,null,null,null,null,null,null,null,null,null,null,null,null,null,null,null,"","",null,null,null,null,"","","",null,"","","","","",""]
[null,null,null,null,null,null,null,null,null,null,null,null,null,null,null,null,null,null,null,null,null,null,null,null,null,null,null,null,null,null,null,null,null,null,null,null,null,null,null,null,"","",null,null,null,null,"","","",null,"","","","","",""]
[null,null,null,null,null,null,null,null,null,null,null,null,null,null,null,null,null,null,null,null,null,null,null,null,null,null,null,null,null,null,null,null,null,null,null,null,null,null,null,null,"","",null,null,null,null,"","","",null,"","","","","",""]
[null,null,null,null,null,null,null,null,null,null,null,null,null,null,null,null,null,null,null,null,null,null,null,null,null,null,null,null,null,null,null,null,null,null,null,null,null,null,null,null,"","",null,null,null,null,"","","",null,"","","","","",""]
[null,null,null,null,null,null,null,null,null,null,null,null,null,null,null,null,null,null,null,null,null,null,null,null,null,null,null,null,null,null,null,null,null,null,null,null,null,null,null,null,"","",null,null,null,null,"","","",null,"","","","","",""]
[null,null,null,null,null,null,null,null,null,null,null,null,null,null,null,null,null,null,null,null,null,null,null,null,null,null,null,null,null,null,null,null,null,null,null,null,null,null,null,null,"","",null,null,null,null,"","","",null,"","","","","",""]
[null,null,null,null,null,null,null,null,null,null,null,null,null,null,null,null,null,null,null,null,null,null,null,null,null,null,null,null,null,null,null,null,null,null,null,null,null,null,null,null,"","",null,null,null,null,"","","",null,"","","","","",""]
[null,null,null,null,null,null,null,null,null,null,null,null,null,null,null,null,null,null,null,null,null,null,null,null,null,null,null,null,null,null,null,null,null,null,null,null,null,null,null,null,"","",null,null,null,null,"","","",null,"","","","","",""]
[null,null,null,null,null,null,null,null,null,null,null,null,null,null,null,null,null,null,null,null,null,null,null,null,null,null,null,null,null,null,null,null,null,null,null,null,null,null,null,null,"","",null,null,null,null,"","","",null,"","","","","",""]
[null,null,null,null,null,null,null,null,null,null,null,null,null,null,null,null,null,null,null,null,null,null,null,null,null,null,null,null,null,null,null,null,null,null,null,null,null,null,null,null,"","",null,null,null,null,"","","",null,"","","","","",""]
[null,null,null,null,null,null,null,null,null,null,null,null,null,null,null,null,null,null,null,null,null,null,null,null,null,null,null,null,null,null,null,null,null,null,null,null,null,null,null,null,"","",null,null,null,null,"","","",null,"","","","","",""]
[null,null,null,null,null,null,null,null,null,null,null,null,null,null,null,null,null,null,null,null,null,null,null,null,null,null,null,null,null,null,null,null,null,null,null,null,null,null,null,null,"","",null,null,null,null,"","","",null,"","","","","",""]
[null,null,null,null,null,null,null,null,null,null,null,null,null,null,null,null,null,null,null,null,null,null,null,null,null,null,null,null,null,null,null,null,null,null,null,null,null,null,null,null,"",""]
[null,null,null,null,null,null,null,null,null,null,null,null,null,null,null,null,null,null,null,null,null,null,null,null,null,null,null,null,null,null,null,null,null,null,null,null,null,null,null,null,"",""]
[null,null,null,null,null,null,null,null,null,null,null,null,null,null,null,null,null,null,null,null,null,null,null,null,null,null,null,null,null,null,null,null,null,null,null,null,null,null,null,null,"",""]
[null,null,null,null,null,null,null,null,null,null,null,null,null,null,null,null,null,null,null,null,null,null,null,null,null,null,null,null,null,null,null,null,null,null,null,null,null,null,null,null,"",""]
[null,null,null,null,null,null,null,null,null,null,null,null,null,null,null,null,null,null,null,null,null,null,null,null,null,null,null,null,null,null,null,null,null,null,null,null,null,null,null,null,"",""]
[null,null,null,null,null,null,null,null,null,null,null,null,null,null,null,null,null,null,null,null,null,null,null,null,null,null,null,null,null,null,null,null,null,null,null,null,null,null,null,null,"",""]
[null,null,null,null,null,null,null,null,null,null,null,null,null,null,null,null,null,null,null,null,null,null,null,null,null,null,null,null,null,null,null,null,null,null,null,null,null,null,null,null,"",""]
[null,null,null,null,null,null,null,null,null,null,null,null,null,null,null,null,null,null,null,null,null,null,null,null,null,null,null,null,null,null,null,null,null,null,null,null,null,null,null,null,"",""]
[null,null,null,null,null,null,null,null,null,null,null,null,null,null,null,null,null,null,null,null,null,null,null,null,null,null,null,null,null,null,null,null,null,null,null,null,null,null,null,null,"",""]
[null,null,null,null,null,null,null,null,null,null,null,null,null,null,null,null,null,null,null,null,null,null,null,null,null,null,null,null,null,null,null,null,null,null,null,null,null,null,null,null,"",""]
[null,null,null,null,null,null,null,null,null,null,null,null,null,null,null,null,null,null,null,null,null,null,null,null,null,null,null,null,null,null,null,null,null,null,null,null,null,null,null,null,"",""]
[null,null,null,null,null,null,null,null,null,null,null,null,null,null,null,null,null,null,null,null,null,null,null,null,null,null,null,null,null,null,null,null,null,null,null,null,null,null,null,null,"",""]
[null,null,null,null,null,null,null,null,null,null,null,null,null,null,null,null,null,null,null,null,null,null,null,null,null,null,null,null,null,null,null,null,null,null,null,null,null,null,null,null,"",""]
[null,null,null,null,null,null,null,null,null,null,null,null,null,null,null,null,null,null,null,null,null,null,null,null,null,null,null,null,null,null,null,null,null,null,null,null,null,null,null,null,"",""]
[null,null,null,null,null,null,null,null,null,null,null,null,null,null,null,null,null,null,null,null,null,null,null,null,null,null,null,null,null,null,null,null,null,null,null,null,null,null,null,null,"",""]
[null,null,null,null,null,null,null,null,null,null,null,null,null,null,null,null,null,null,null,null,null,null,null,null,null,null,null,null,null,null,null,null,null,null,null,null,null,null,null,null,"",""]
[null,null,null,null,null,null,null,null,null,null,null,null,null,null,null,null,null,null,null,null,null,null,null,null,null,null,null,null,null,null,null,null,null,null,null,null,null,null,null,null,"",""]
[null,null,null,null,null,null,null,null,null,null,null,null,null,null,null,null,null,null,null,null,null,null,null,null,null,null,null,null,null,null,null,null,null,null,null,null,null,null,null,null,"",""]
[null,null,null,null,null,null,null,null,null,null,null,null,null,null,null,null,null,null,null,null,null,null,null,null,null,null,null,null,null,null,null,null,null,null,null,null,null,null,null,null,"",""]
[null,null,null,null,null,null,null,null,null,null,null,null,null,null,null,null,null,null,null,null,null,null,null,null,null,null,null,null,null,null,null,null,null,null,null,null,null,null,null,null,"",""]
[null,null,null,null,null,null,null,null,null,null,null,null,null,null,null,null,null,null,null,null,null,null,null,null,null,null,null,null,null,null,null,null,null,null,null,null,null,null,null,null,"",""]
[null,null,null,null,null,null,null,null,null,null,null,null,null,null,null,null,null,null,null,null,null,null,null,null,null,null,null,null,null,null,null,null,null,null,null,null,null,null,null,null,"",""]
[null,null,null,null,null,null,null,null,null,null,null,null,null,null,null,null,null,null,null,null,null,null,null,null,null,null,null,null,null,null,null,null,null,null,null,null,null,null,null,null,"",""]
[null,null,null,null,null,null,null,null,null,null,null,null,null,null,null,null,null,null,null,null,null,null,null,null,null,null,null,null,null,null,null,null,null,null,null,null,null,null,null,null,"",""]
[null,null,null,null,null,null,null,null,null,null,null,null,null,null,null,null,null,null,null,null,null,null,null,null,null,null,null,null,null,null,null,null,null,null,null,null,null,null,null,null,{"$f":"IF(AN325=\"\",\"\",IFERROR(MATCH(AN325,$AD$4:$AD$1000,0),_xlfn.XLOOKUP(AN325,$Y$4:$Y$1000,$AA$4:$AA$1000,\"\",0)))","v":""},""]
[null,null,null,null,null,null,null,null,null,null,null,null,null,null,null,null,null,null,null,null,null,null,null,null,null,null,null,null,null,null,null,null,null,null,null,null,null,null,null,null,"",""]
[null,null,null,null,null,null,null,null,null,null,null,null,null,null,null,null,null,null,null,null,null,null,null,null,null,null,null,null,null,null,null,null,null,null,null,null,null,null,null,null,"",""]
[null,null,null,null,null,null,null,null,null,null,null,null,null,null,null,null,null,null,null,null,null,null,null,null,null,null,null,null,null,null,null,null,null,null,null,null,null,null,null,null,"",""]
[null,null,null,null,null,null,null,null,null,null,null,null,null,null,null,null,null,null,null,null,null,null,null,null,null,null,null,null,null,null,null,null,null,null,null,null,null,null,null,null,"",""]
[null,null,null,null,null,null,null,null,null,null,null,null,null,null,null,null,null,null,null,null,null,null,null,null,null,null,null,null,null,null,null,null,null,null,null,null,null,null,null,null,"",""]
[null,null,null,null,null,null,null,null,null,null,null,null,null,null,null,null,null,null,null,null,null,null,null,null,null,null,null,null,null,null,null,null,null,null,null,null,null,null,null,null,"",""]
[null,null,null,null,null,null,null,null,null,null,null,null,null,null,null,null,null,null,null,null,null,null,null,null,null,null,null,null,null,null,null,null,null,null,null,null,null,null,null,null,"",""]
[null,null,null,null,null,null,null,null,null,null,null,null,null,null,null,null,null,null,null,null,null,null,null,null,null,null,null,null,null,null,null,null,null,null,null,null,null,null,null,null,"",""]
[null,null,null,null,null,null,null,null,null,null,null,null,null,null,null,null,null,null,null,null,null,null,null,null,null,null,null,null,null,null,null,null,null,null,null,null,null,null,null,null,"",""]
[null,null,null,null,null,null,null,null,null,null,null,null,null,null,null,null,null,null,null,null,null,null,null,null,null,null,null,null,null,null,null,null,null,null,null,null,null,null,null,null,"",""]
[null,null,null,null,null,null,null,null,null,null,null,null,null,null,null,null,null,null,null,null,null,null,null,null,null,null,null,null,null,null,null,null,null,null,null,null,null,null,null,null,"",""]
[null,null,null,null,null,null,null,null,null,null,null,null,null,null,null,null,null,null,null,null,null,null,null,null,null,null,null,null,null,null,null,null,null,null,null,null,null,null,null,null,"",""]
[null,null,null,null,null,null,null,null,null,null,null,null,null,null,null,null,null,null,null,null,null,null,null,null,null,null,null,null,null,null,null,null,null,null,null,null,null,null,null,null,"",""]
[null,null,null,null,null,null,null,null,null,null,null,null,null,null,null,null,null,null,null,null,null,null,null,null,null,null,null,null,null,null,null,null,null,null,null,null,null,null,null,null,"",""]
[null,null,null,null,null,null,null,null,null,null,null,null,null,null,null,null,null,null,null,null,null,null,null,null,null,null,null,null,null,null,null,null,null,null,null,null,null,null,null,null,"",""]
[null,null,null,null,null,null,null,null,null,null,null,null,null,null,null,null,null,null,null,null,null,null,null,null,null,null,null,null,null,null,null,null,null,null,null,null,null,null,null,null,"",""]
[null,null,null,null,null,null,null,null,null,null,null,null,null,null,null,null,null,null,null,null,null,null,null,null,null,null,null,null,null,null,null,null,null,null,null,null,null,null,null,null,"",{"$f":"IF(AN342=\"\",\"\",IF(N(AO342)=0,AO342,AM342))","v":""}]
[null,null,null,null,null,null,null,null,null,null,null,null,null,null,null,null,null,null,null,null,null,null,null,null,null,null,null,null,null,null,null,null,null,null,null,null,null,null,null,null,"",""]
[null,null,null,null,null,null,null,null,null,null,null,null,null,null,null,null,null,null,null,null,null,null,null,null,null,null,null,null,null,null,null,null,null,null,null,null,null,null,null,null,"",""]
[null,null,null,null,null,null,null,null,null,null,null,null,null,null,null,null,null,null,null,null,null,null,null,null,null,null,null,null,null,null,null,null,null,null,null,null,null,null,null,null,"",""]
[null,null,null,null,null,null,null,null,null,null,null,null,null,null,null,null,null,null,null,null,null,null,null,null,null,null,null,null,null,null,null,null,null,null,null,null,null,null,null,null,"",""]
[null,null,null,null,null,null,null,null,null,null,null,null,null,null,null,null,null,null,null,null,null,null,null,null,null,null,null,null,null,null,null,null,null,null,null,null,null,null,null,null,"",""]
[null,null,null,null,null,null,null,null,null,null,null,null,null,null,null,null,null,null,null,null,null,null,null,null,null,null,null,null,null,null,null,null,null,null,null,null,null,null,null,null,"",""]
[null,null,null,null,null,null,null,null,null,null,null,null,null,null,null,null,null,null,null,null,null,null,null,null,null,null,null,null,null,null,null,null,null,null,null,null,null,null,null,null,"",""]
[null,null,null,null,null,null,null,null,null,null,null,null,null,null,null,null,null,null,null,null,null,null,null,null,null,null,null,null,null,null,null,null,null,null,null,null,null,null,null,null,"",""]
[null,null,null,null,null,null,null,null,null,null,null,null,null,null,null,null,null,null,null,null,null,null,null,null,null,null,null,null,null,null,null,null,null,null,null,null,null,null,null,null,"",""]
[null,null,null,null,null,null,null,null,null,null,null,null,null,null,null,null,null,null,null,null,null,null,null,null,null,null,null,null,null,null,null,null,null,null,null,null,null,null,null,null,"",""]
[null,null,null,null,null,null,null,null,null,null,null,null,null,null,null,null,null,null,null,null,null,null,null,null,null,null,null,null,null,null,null,null,null,null,null,null,null,null,null,null,"",""]
[null,null,null,null,null,null,null,null,null,null,null,null,null,null,null,null,null,null,null,null,null,null,null,null,null,null,null,null,null,null,null,null,null,null,null,null,null,null,null,null,"",""]
[null,null,null,null,null,null,null,null,null,null,null,null,null,null,null,null,null,null,null,null,null,null,null,null,null,null,null,null,null,null,null,null,null,null,null,null,null,null,null,null,"",""]
[null,null,null,null,null,null,null,null,null,null,null,null,null,null,null,null,null,null,null,null,null,null,null,null,null,null,null,null,null,null,null,null,null,null,null,null,null,null,null,null,"",""]
[null,null,null,null,null,null,null,null,null,null,null,null,null,null,null,null,null,null,null,null,null,null,null,null,null,null,null,null,null,null,null,null,null,null,null,null,null,null,null,null,"",""]
[null,null,null,null,null,null,null,null,null,null,null,null,null,null,null,null,null,null,null,null,null,null,null,null,null,null,null,null,null,null,null,null,null,null,null,null,null,null,null,null,"",""]
[null,null,null,null,null,null,null,null,null,null,null,null,null,null,null,null,null,null,null,null,null,null,null,null,null,null,null,null,null,null,null,null,null,null,null,null,null,null,null,null,"",""]
[null,null,null,null,null,null,null,null,null,null,null,null,null,null,null,null,null,null,null,null,null,null,null,null,null,null,null,null,null,null,null,null,null,null,null,null,null,null,null,null,"",""]
[null,null,null,null,null,null,null,null,null,null,null,null,null,null,null,null,null,null,null,null,null,null,null,null,null,null,null,null,null,null,null,null,null,null,null,null,null,null,null,null,"",""]
[null,null,null,null,null,null,null,null,null,null,null,null,null,null,null,null,null,null,null,null,null,null,null,null,null,null,null,null,null,null,null,null,null,null,null,null,null,null,null,null,"",""]
[null,null,null,null,null,null,null,null,null,null,null,null,null,null,null,null,null,null,null,null,null,null,null,null,null,null,null,null,null,null,null,null,null,null,null,null,null,null,null,null,"",""]
[null,null,null,null,null,null,null,null,null,null,null,null,null,null,null,null,null,null,null,null,null,null,null,null,null,null,null,null,null,null,null,null,null,null,null,null,null,null,null,null,"",""]
[null,null,null,null,null,null,null,null,null,null,null,null,null,null,null,null,null,null,null,null,null,null,null,null,null,null,null,null,null,null,null,null,null,null,null,null,null,null,null,null,"",""]
[null,null,null,null,null,null,null,null,null,null,null,null,null,null,null,null,null,null,null,null,null,null,null,null,null,null,null,null,null,null,null,null,null,null,null,null,null,null,null,null,"",""]
[null,null,null,null,null,null,null,null,null,null,null,null,null,null,null,null,null,null,null,null,null,null,null,null,null,null,null,null,null,null,null,null,null,null,null,null,null,null,null,null,"",""]
[null,null,null,null,null,null,null,null,null,null,null,null,null,null,null,null,null,null,null,null,null,null,null,null,null,null,null,null,null,null,null,null,null,null,null,null,null,null,null,null,"",""]
[null,null,null,null,null,null,null,null,null,null,null,null,null,null,null,null,null,null,null,null,null,null,null,null,null,null,null,null,null,null,null,null,null,null,null,null,null,null,null,null,"",""]
[null,null,null,null,null,null,null,null,null,null,null,null,null,null,null,null,null,null,null,null,null,null,null,null,null,null,null,null,null,null,null,null,null,null,null,null,null,null,null,null,"",""]
[null,null,null,null,null,null,null,null,null,null,null,null,null,null,null,null,null,null,null,null,null,null,null,null,null,null,null,null,null,null,null,null,null,null,null,null,null,null,null,null,"",""]
[null,null,null,null,null,null,null,null,null,null,null,null,null,null,null,null,null,null,null,null,null,null,null,null,null,null,null,null,null,null,null,null,null,null,null,null,null,null,null,null,"",""]
[null,null,null,null,null,null,null,null,null,null,null,null,null,null,null,null,null,null,null,null,null,null,null,null,null,null,null,null,null,null,null,null,null,null,null,null,null,null,null,null,"",""]
[null,null,null,null,null,null,null,null,null,null,null,null,null,null,null,null,null,null,null,null,null,null,null,null,null,null,null,null,null,null,null,null,null,null,null,null,null,null,null,null,"",""]
[null,null,null,null,null,null,null,null,null,null,null,null,null,null,null,null,null,null,null,null,null,null,null,null,null,null,null,null,null,null,null,null,null,null,null,null,null,null,null,null,"",""]
[null,null,null,null,null,null,null,null,null,null,null,null,null,null,null,null,null,null,null,null,null,null,null,null,null,null,null,null,null,null,null,null,null,null,null,null,null,null,null,null,"",""]
[null,null,null,null,null,null,null,null,null,null,null,null,null,null,null,null,null,null,null,null,null,null,null,null,null,null,null,null,null,null,null,null,null,null,null,null,null,null,null,null,"",""]
[null,null,null,null,null,null,null,null,null,null,null,null,null,null,null,null,null,null,null,null,null,null,null,null,null,null,null,null,null,null,null,null,null,null,null,null,null,null,null,null,"",""]
[null,null,null,null,null,null,null,null,null,null,null,null,null,null,null,null,null,null,null,null,null,null,null,null,null,null,null,null,null,null,null,null,null,null,null,null,null,null,null,null,"",""]
[null,null,null,null,null,null,null,null,null,null,null,null,null,null,null,null,null,null,null,null,null,null,null,null,null,null,null,null,null,null,null,null,null,null,null,null,null,null,null,null,"",""]
[null,null,null,null,null,null,null,null,null,null,null,null,null,null,null,null,null,null,null,null,null,null,null,null,null,null,null,null,null,null,null,null,null,null,null,null,null,null,null,null,"",""]
[null,null,null,null,null,null,null,null,null,null,null,null,null,null,null,null,null,null,null,null,null,null,null,null,null,null,null,null,null,null,null,null,null,null,null,null,null,null,null,null,"",""]
[null,null,null,null,null,null,null,null,null,null,null,null,null,null,null,null,null,null,null,null,null,null,null,null,null,null,null,null,null,null,null,null,null,null,null,null,null,null,null,null,"",""]
[null,null,null,null,null,null,null,null,null,null,null,null,null,null,null,null,null,null,null,null,null,null,null,null,null,null,null,null,null,null,null,null,null,null,null,null,null,null,null,null,"",""]
[null,null,null,null,null,null,null,null,null,null,null,null,null,null,null,null,null,null,null,null,null,null,null,null,null,null,null,null,null,null,null,null,null,null,null,null,null,null,null,null,"",""]
[null,null,null,null,null,null,null,null,null,null,null,null,null,null,null,null,null,null,null,null,null,null,null,null,null,null,null,null,null,null,null,null,null,null,null,null,null,null,null,null,"",""]
[null,null,null,null,null,null,null,null,null,null,null,null,null,null,null,null,null,null,null,null,null,null,null,null,null,null,null,null,null,null,null,null,null,null,null,null,null,null,null,null,"",""]
[null,null,null,null,null,null,null,null,null,null,null,null,null,null,null,null,null,null,null,null,null,null,null,null,null,null,null,null,null,null,null,null,null,null,null,null,null,null,null,null,"",""]
[null,null,null,null,null,null,null,null,null,null,null,null,null,null,null,null,null,null,null,null,null,null,null,null,null,null,null,null,null,null,null,null,null,null,null,null,null,null,null,null,{"$f":"IF(AN389=\"\",\"\",IFERROR(MATCH(AN389,$AD$4:$AD$1000,0),_xlfn.XLOOKUP(AN389,$Y$4:$Y$1000,$AA$4:$AA$1000,\"\",0)))","v":""},""]
[null,null,null,null,null,null,null,null,null,null,null,null,null,null,null,null,null,null,null,null,null,null,null,null,null,null,null,null,null,null,null,null,null,null,null,null,null,null,null,null,"",""]
[null,null,null,null,null,null,null,null,null,null,null,null,null,null,null,null,null,null,null,null,null,null,null,null,null,null,null,null,null,null,null,null,null,null,null,null,null,null,null,null,"",""]
[null,null,null,null,null,null,null,null,null,null,null,null,null,null,null,null,null,null,null,null,null,null,null,null,null,null,null,null,null,null,null,null,null,null,null,null,null,null,null,null,"",""]
[null,null,null,null,null,null,null,null,null,null,null,null,null,null,null,null,null,null,null,null,null,null,null,null,null,null,null,null,null,null,null,null,null,null,null,null,null,null,null,null,"",""]
[null,null,null,null,null,null,null,null,null,null,null,null,null,null,null,null,null,null,null,null,null,null,null,null,null,null,null,null,null,null,null,null,null,null,null,null,null,null,null,null,"",""]
[null,null,null,null,null,null,null,null,null,null,null,null,null,null,null,null,null,null,null,null,null,null,null,null,null,null,null,null,null,null,null,null,null,null,null,null,null,null,null,null,"",""]
[null,null,null,null,null,null,null,null,null,null,null,null,null,null,null,null,null,null,null,null,null,null,null,null,null,null,null,null,null,null,null,null,null,null,null,null,null,null,null,null,"",""]
[null,null,null,null,null,null,null,null,null,null,null,null,null,null,null,null,null,null,null,null,null,null,null,null,null,null,null,null,null,null,null,null,null,null,null,null,null,null,null,null,"",""]
[null,null,null,null,null,null,null,null,null,null,null,null,null,null,null,null,null,null,null,null,null,null,null,null,null,null,null,null,null,null,null,null,null,null,null,null,null,null,null,null,"",""]
[null,null,null,null,null,null,null,null,null,null,null,null,null,null,null,null,null,null,null,null,null,null,null,null,null,null,null,null,null,null,null,null,null,null,null,null,null,null,null,null,"",""]
[null,null,null,null,null,null,null,null,null,null,null,null,null,null,null,null,null,null,null,null,null,null,null,null,null,null,null,null,null,null,null,null,null,null,null,null,null,null,null,null,"",""]
[null,null,null,null,null,null,null,null,null,null,null,null,null,null,null,null,null,null,null,null,null,null,null,null,null,null,null,null,null,null,null,null,null,null,null,null,null,null,null,null,"",""]
[null,null,null,null,null,null,null,null,null,null,null,null,null,null,null,null,null,null,null,null,null,null,null,null,null,null,null,null,null,null,null,null,null,null,null,null,null,null,null,null,"",""]
[null,null,null,null,null,null,null,null,null,null,null,null,null,null,null,null,null,null,null,null,null,null,null,null,null,null,null,null,null,null,null,null,null,null,null,null,null,null,null,null,"",""]
[null,null,null,null,null,null,null,null,null,null,null,null,null,null,null,null,null,null,null,null,null,null,null,null,null,null,null,null,null,null,null,null,null,null,null,null,null,null,null,null,"",""]
[null,null,null,null,null,null,null,null,null,null,null,null,null,null,null,null,null,null,null,null,null,null,null,null,null,null,null,null,null,null,null,null,null,null,null,null,null,null,null,null,"",""]
[null,null,null,null,null,null,null,null,null,null,null,null,null,null,null,null,null,null,null,null,null,null,null,null,null,null,null,null,null,null,null,null,null,null,null,null,null,null,null,null,"",{"$f":"IF(AN406=\"\",\"\",IF(N(AO406)=0,AO406,AM406))","v":""}]
[null,null,null,null,null,null,null,null,null,null,null,null,null,null,null,null,null,null,null,null,null,null,null,null,null,null,null,null,null,null,null,null,null,null,null,null,null,null,null,null,"",""]
[null,null,null,null,null,null,null,null,null,null,null,null,null,null,null,null,null,null,null,null,null,null,null,null,null,null,null,null,null,null,null,null,null,null,null,null,null,null,null,null,"",""]
[null,null,null,null,null,null,null,null,null,null,null,null,null,null,null,null,null,null,null,null,null,null,null,null,null,null,null,null,null,null,null,null,null,null,null,null,null,null,null,null,"",""]
[null,null,null,null,null,null,null,null,null,null,null,null,null,null,null,null,null,null,null,null,null,null,null,null,null,null,null,null,null,null,null,null,null,null,null,null,null,null,null,null,"",""]
[null,null,null,null,null,null,null,null,null,null,null,null,null,null,null,null,null,null,null,null,null,null,null,null,null,null,null,null,null,null,null,null,null,null,null,null,null,null,null,null,"",""]
[null,null,null,null,null,null,null,null,null,null,null,null,null,null,null,null,null,null,null,null,null,null,null,null,null,null,null,null,null,null,null,null,null,null,null,null,null,null,null,null,"",""]
[null,null,null,null,null,null,null,null,null,null,null,null,null,null,null,null,null,null,null,null,null,null,null,null,null,null,null,null,null,null,null,null,null,null,null,null,null,null,null,null,"",""]
[null,null,null,null,null,null,null,null,null,null,null,null,null,null,null,null,null,null,null,null,null,null,null,null,null,null,null,null,null,null,null,null,null,null,null,null,null,null,null,null,"",""]
[null,null,null,null,null,null,null,null,null,null,null,null,null,null,null,null,null,null,null,null,null,null,null,null,null,null,null,null,null,null,null,null,null,null,null,null,null,null,null,null,"",""]
[null,null,null,null,null,null,null,null,null,null,null,null,null,null,null,null,null,null,null,null,null,null,null,null,null,null,null,null,null,null,null,null,null,null,null,null,null,null,null,null,"",""]
[null,null,null,null,null,null,null,null,null,null,null,null,null,null,null,null,null,null,null,null,null,null,null,null,null,null,null,null,null,null,null,null,null,null,null,null,null,null,null,null,"",""]
[null,null,null,null,null,null,null,null,null,null,null,null,null,null,null,null,null,null,null,null,null,null,null,null,null,null,null,null,null,null,null,null,null,null,null,null,null,null,null,null,"",""]
[null,null,null,null,null,null,null,null,null,null,null,null,null,null,null,null,null,null,null,null,null,null,null,null,null,null,null,null,null,null,null,null,null,null,null,null,null,null,null,null,"",""]
[null,null,null,null,null,null,null,null,null,null,null,null,null,null,null,null,null,null,null,null,null,null,null,null,null,null,null,null,null,null,null,null,null,null,null,null,null,null,null,null,"",""]
[null,null,null,null,null,null,null,null,null,null,null,null,null,null,null,null,null,null,null,null,null,null,null,null,null,null,null,null,null,null,null,null,null,null,null,null,null,null,null,null,"",""]
[null,null,null,null,null,null,null,null,null,null,null,null,null,null,null,null,null,null,null,null,null,null,null,null,null,null,null,null,null,null,null,null,null,null,null,null,null,null,null,null,"",""]
[null,null,null,null,null,null,null,null,null,null,null,null,null,null,null,null,null,null,null,null,null,null,null,null,null,null,null,null,null,null,null,null,null,null,null,null,null,null,null,null,"",""]
[null,null,null,null,null,null,null,null,null,null,null,null,null,null,null,null,null,null,null,null,null,null,null,null,null,null,null,null,null,null,null,null,null,null,null,null,null,null,null,null,"",""]
[null,null,null,null,null,null,null,null,null,null,null,null,null,null,null,null,null,null,null,null,null,null,null,null,null,null,null,null,null,null,null,null,null,null,null,null,null,null,null,null,"",""]
[null,null,null,null,null,null,null,null,null,null,null,null,null,null,null,null,null,null,null,null,null,null,null,null,null,null,null,null,null,null,null,null,null,null,null,null,null,null,null,null,"",""]
[null,null,null,null,null,null,null,null,null,null,null,null,null,null,null,null,null,null,null,null,null,null,null,null,null,null,null,null,null,null,null,null,null,null,null,null,null,null,null,null,"",""]
[null,null,null,null,null,null,null,null,null,null,null,null,null,null,null,null,null,null,null,null,null,null,null,null,null,null,null,null,null,null,null,null,null,null,null,null,null,null,null,null,"",""]
[null,null,null,null,null,null,null,null,null,null,null,null,null,null,null,null,null,null,null,null,null,null,null,null,null,null,null,null,null,null,null,null,null,null,null,null,null,null,null,null,"",""]
[null,null,null,null,null,null,null,null,null,null,null,null,null,null,null,null,null,null,null,null,null,null,null,null,null,null,null,null,null,null,null,null,null,null,null,null,null,null,null,null,"",""]
[null,null,null,null,null,null,null,null,null,null,null,null,null,null,null,null,null,null,null,null,null,null,null,null,null,null,null,null,null,null,null,null,null,null,null,null,null,null,null,null,"",""]
[null,null,null,null,null,null,null,null,null,null,null,null,null,null,null,null,null,null,null,null,null,null,null,null,null,null,null,null,null,null,null,null,null,null,null,null,null,null,null,null,"",""]
[null,null,null,null,null,null,null,null,null,null,null,null,null,null,null,null,null,null,null,null,null,null,null,null,null,null,null,null,null,null,null,null,null,null,null,null,null,null,null,null,"",""]
[null,null,null,null,null,null,null,null,null,null,null,null,null,null,null,null,null,null,null,null,null,null,null,null,null,null,null,null,null,null,null,null,null,null,null,null,null,null,null,null,"",""]
[null,null,null,null,null,null,null,null,null,null,null,null,null,null,null,null,null,null,null,null,null,null,null,null,null,null,null,null,null,null,null,null,null,null,null,null,null,null,null,null,"",""]
[null,null,null,null,null,null,null,null,null,null,null,null,null,null,null,null,null,null,null,null,null,null,null,null,null,null,null,null,null,null,null,null,null,null,null,null,null,null,null,null,"",""]
[null,null,null,null,null,null,null,null,null,null,null,null,null,null,null,null,null,null,null,null,null,null,null,null,null,null,null,null,null,null,null,null,null,null,null,null,null,null,null,null,"",""]
[null,null,null,null,null,null,null,null,null,null,null,null,null,null,null,null,null,null,null,null,null,null,null,null,null,null,null,null,null,null,null,null,null,null,null,null,null,null,null,null,"",""]
[null,null,null,null,null,null,null,null,null,null,null,null,null,null,null,null,null,null,null,null,null,null,null,null,null,null,null,null,null,null,null,null,null,null,null,null,null,null,null,null,"",""]
[null,null,null,null,null,null,null,null,null,null,null,null,null,null,null,null,null,null,null,null,null,null,null,null,null,null,null,null,null,null,null,null,null,null,null,null,null,null,null,null,"",""]
[null,null,null,null,null,null,null,null,null,null,null,null,null,null,null,null,null,null,null,null,null,null,null,null,null,null,null,null,null,null,null,null,null,null,null,null,null,null,null,null,"",""]
[null,null,null,null,null,null,null,null,null,null,null,null,null,null,null,null,null,null,null,null,null,null,null,null,null,null,null,null,null,null,null,null,null,null,null,null,null,null,null,null,"",""]
[null,null,null,null,null,null,null,null,null,null,null,null,null,null,null,null,null,null,null,null,null,null,null,null,null,null,null,null,null,null,null,null,null,null,null,null,null,null,null,null,"",""]
[null,null,null,null,null,null,null,null,null,null,null,null,null,null,null,null,null,null,null,null,null,null,null,null,null,null,null,null,null,null,null,null,null,null,null,null,null,null,null,null,"",""]
[null,null,null,null,null,null,null,null,null,null,null,null,null,null,null,null,null,null,null,null,null,null,null,null,null,null,null,null,null,null,null,null,null,null,null,null,null,null,null,null,"",""]
[null,null,null,null,null,null,null,null,null,null,null,null,null,null,null,null,null,null,null,null,null,null,null,null,null,null,null,null,null,null,null,null,null,null,null,null,null,null,null,null,"",""]
[null,null,null,null,null,null,null,null,null,null,null,null,null,null,null,null,null,null,null,null,null,null,null,null,null,null,null,null,null,null,null,null,null,null,null,null,null,null,null,null,"",""]
[null,null,null,null,null,null,null,null,null,null,null,null,null,null,null,null,null,null,null,null,null,null,null,null,null,null,null,null,null,null,null,null,null,null,null,null,null,null,null,null,"",""]
[null,null,null,null,null,null,null,null,null,null,null,null,null,null,null,null,null,null,null,null,null,null,null,null,null,null,null,null,null,null,null,null,null,null,null,null,null,null,null,null,"",""]
[null,null,null,null,null,null,null,null,null,null,null,null,null,null,null,null,null,null,null,null,null,null,null,null,null,null,null,null,null,null,null,null,null,null,null,null,null,null,null,null,"",""]
[null,null,null,null,null,null,null,null,null,null,null,null,null,null,null,null,null,null,null,null,null,null,null,null,null,null,null,null,null,null,null,null,null,null,null,null,null,null,null,null,"",""]
[null,null,null,null,null,null,null,null,null,null,null,null,null,null,null,null,null,null,null,null,null,null,null,null,null,null,null,null,null,null,null,null,null,null,null,null,null,null,null,null,"",""]
[null,null,null,null,null,null,null,null,null,null,null,null,null,null,null,null,null,null,null,null,null,null,null,null,null,null,null,null,null,null,null,null,null,null,null,null,null,null,null,null,{"$f":"IF(AN453=\"\",\"\",IFERROR(MATCH(AN453,$AD$4:$AD$1000,0),_xlfn.XLOOKUP(AN453,$Y$4:$Y$1000,$AA$4:$AA$1000,\"\",0)))","v":""},""]
[null,null,null,null,null,null,null,null,null,null,null,null,null,null,null,null,null,null,null,null,null,null,null,null,null,null,null,null,null,null,null,null,null,null,null,null,null,null,null,null,"",""]
[null,null,null,null,null,null,null,null,null,null,null,null,null,null,null,null,null,null,null,null,null,null,null,null,null,null,null,null,null,null,null,null,null,null,null,null,null,null,null,null,"",""]
[null,null,null,null,null,null,null,null,null,null,null,null,null,null,null,null,null,null,null,null,null,null,null,null,null,null,null,null,null,null,null,null,null,null,null,null,null,null,null,null,"",""]
[null,null,null,null,null,null,null,null,null,null,null,null,null,null,null,null,null,null,null,null,null,null,null,null,null,null,null,null,null,null,null,null,null,null,null,null,null,null,null,null,"",""]
[null,null,null,null,null,null,null,null,null,null,null,null,null,null,null,null,null,null,null,null,null,null,null,null,null,null,null,null,null,null,null,null,null,null,null,null,null,null,null,null,"",""]
[null,null,null,null,null,null,null,null,null,null,null,null,null,null,null,null,null,null,null,null,null,null,null,null,null,null,null,null,null,null,null,null,null,null,null,null,null,null,null,null,"",""]
[null,null,null,null,null,null,null,null,null,null,null,null,null,null,null,null,null,null,null,null,null,null,null,null,null,null,null,null,null,null,null,null,null,null,null,null,null,null,null,null,"",""]
[null,null,null,null,null,null,null,null,null,null,null,null,null,null,null,null,null,null,null,null,null,null,null,null,null,null,null,null,null,null,null,null,null,null,null,null,null,null,null,null,"",""]
[null,null,null,null,null,null,null,null,null,null,null,null,null,null,null,null,null,null,null,null,null,null,null,null,null,null,null,null,null,null,null,null,null,null,null,null,null,null,null,null,"",""]
[null,null,null,null,null,null,null,null,null,null,null,null,null,null,null,null,null,null,null,null,null,null,null,null,null,null,null,null,null,null,null,null,null,null,null,null,null,null,null,null,"",""]
[null,null,null,null,null,null,null,null,null,null,null,null,null,null,null,null,null,null,null,null,null,null,null,null,null,null,null,null,null,null,null,null,null,null,null,null,null,null,null,null,"",""]
[null,null,null,null,null,null,null,null,null,null,null,null,null,null,null,null,null,null,null,null,null,null,null,null,null,null,null,null,null,null,null,null,null,null,null,null,null,null,null,null,"",""]
[null,null,null,null,null,null,null,null,null,null,null,null,null,null,null,null,null,null,null,null,null,null,null,null,null,null,null,null,null,null,null,null,null,null,null,null,null,null,null,null,"",""]
[null,null,null,null,null,null,null,null,null,null,null,null,null,null,null,null,null,null,null,null,null,null,null,null,null,null,null,null,null,null,null,null,null,null,null,null,null,null,null,null,"",""]
[null,null,null,null,null,null,null,null,null,null,null,null,null,null,null,null,null,null,null,null,null,null,null,null,null,null,null,null,null,null,null,null,null,null,null,null,null,null,null,null,"",""]
[null,null,null,null,null,null,null,null,null,null,null,null,null,null,null,null,null,null,null,null,null,null,null,null,null,null,null,null,null,null,null,null,null,null,null,null,null,null,null,null,"",""]
[null,null,null,null,null,null,null,null,null,null,null,null,null,null,null,null,null,null,null,null,null,null,null,null,null,null,null,null,null,null,null,null,null,null,null,null,null,null,null,null,"",{"$f":"IF(AN470=\"\",\"\",IF(N(AO470)=0,AO470,AM470))","v":""}]
[null,null,null,null,null,null,null,null,null,null,null,null,null,null,null,null,null,null,null,null,null,null,null,null,null,null,null,null,null,null,null,null,null,null,null,null,null,null,null,null,"",""]
[null,null,null,null,null,null,null,null,null,null,null,null,null,null,null,null,null,null,null,null,null,null,null,null,null,null,null,null,null,null,null,null,null,null,null,null,null,null,null,null,"",""]
[null,null,null,null,null,null,null,null,null,null,null,null,null,null,null,null,null,null,null,null,null,null,null,null,null,null,null,null,null,null,null,null,null,null,null,null,null,null,null,null,"",""]
[null,null,null,null,null,null,null,null,null,null,null,null,null,null,null,null,null,null,null,null,null,null,null,null,null,null,null,null,null,null,null,null,null,null,null,null,null,null,null,null,"",""]
[null,null,null,null,null,null,null,null,null,null,null,null,null,null,null,null,null,null,null,null,null,null,null,null,null,null,null,null,null,null,null,null,null,null,null,null,null,null,null,null,"",""]
[null,null,null,null,null,null,null,null,null,null,null,null,null,null,null,null,null,null,null,null,null,null,null,null,null,null,null,null,null,null,null,null,null,null,null,null,null,null,null,null,"",""]
[null,null,null,null,null,null,null,null,null,null,null,null,null,null,null,null,null,null,null,null,null,null,null,null,null,null,null,null,null,null,null,null,null,null,null,null,null,null,null,null,"",""]
[null,null,null,null,null,null,null,null,null,null,null,null,null,null,null,null,null,null,null,null,null,null,null,null,null,null,null,null,null,null,null,null,null,null,null,null,null,null,null,null,"",""]
[null,null,null,null,null,null,null,null,null,null,null,null,null,null,null,null,null,null,null,null,null,null,null,null,null,null,null,null,null,null,null,null,null,null,null,null,null,null,null,null,"",""]
[null,null,null,null,null,null,null,null,null,null,null,null,null,null,null,null,null,null,null,null,null,null,null,null,null,null,null,null,null,null,null,null,null,null,null,null,null,null,null,null,"",""]
[null,null,null,null,null,null,null,null,null,null,null,null,null,null,null,null,null,null,null,null,null,null,null,null,null,null,null,null,null,null,null,null,null,null,null,null,null,null,null,null,"",""]
[null,null,null,null,null,null,null,null,null,null,null,null,null,null,null,null,null,null,null,null,null,null,null,null,null,null,null,null,null,null,null,null,null,null,null,null,null,null,null,null,"",""]
[null,null,null,null,null,null,null,null,null,null,null,null,null,null,null,null,null,null,null,null,null,null,null,null,null,null,null,null,null,null,null,null,null,null,null,null,null,null,null,null,"",""]
[null,null,null,null,null,null,null,null,null,null,null,null,null,null,null,null,null,null,null,null,null,null,null,null,null,null,null,null,null,null,null,null,null,null,null,null,null,null,null,null,"",""]
[null,null,null,null,null,null,null,null,null,null,null,null,null,null,null,null,null,null,null,null,null,null,null,null,null,null,null,null,null,null,null,null,null,null,null,null,null,null,null,null,"",""]
[null,null,null,null,null,null,null,null,null,null,null,null,null,null,null,null,null,null,null,null,null,null,null,null,null,null,null,null,null,null,null,null,null,null,null,null,null,null,null,null,"",""]
[null,null,null,null,null,null,null,null,null,null,null,null,null,null,null,null,null,null,null,null,null,null,null,null,null,null,null,null,null,null,null,null,null,null,null,null,null,null,null,null,"",""]
[null,null,null,null,null,null,null,null,null,null,null,null,null,null,null,null,null,null,null,null,null,null,null,null,null,null,null,null,null,null,null,null,null,null,null,null,null,null,null,null,"",""]
[null,null,null,null,null,null,null,null,null,null,null,null,null,null,null,null,null,null,null,null,null,null,null,null,null,null,null,null,null,null,null,null,null,null,null,null,null,null,null,null,"",""]
[null,null,null,null,null,null,null,null,null,null,null,null,null,null,null,null,null,null,null,null,null,null,null,null,null,null,null,null,null,null,null,null,null,null,null,null,null,null,null,null,"",""]
[null,null,null,null,null,null,null,null,null,null,null,null,null,null,null,null,null,null,null,null,null,null,null,null,null,null,null,null,null,null,null,null,null,null,null,null,null,null,null,null,"",""]
[null,null,null,null,null,null,null,null,null,null,null,null,null,null,null,null,null,null,null,null,null,null,null,null,null,null,null,null,null,null,null,null,null,null,null,null,null,null,null,null,"",""]
[null,null,null,null,null,null,null,null,null,null,null,null,null,null,null,null,null,null,null,null,null,null,null,null,null,null,null,null,null,null,null,null,null,null,null,null,null,null,null,null,"",""]
[null,null,null,null,null,null,null,null,null,null,null,null,null,null,null,null,null,null,null,null,null,null,null,null,null,null,null,null,null,null,null,null,null,null,null,null,null,null,null,null,"",""]
[null,null,null,null,null,null,null,null,null,null,null,null,null,null,null,null,null,null,null,null,null,null,null,null,null,null,null,null,null,null,null,null,null,null,null,null,null,null,null,null,"",""]
[null,null,null,null,null,null,null,null,null,null,null,null,null,null,null,null,null,null,null,null,null,null,null,null,null,null,null,null,null,null,null,null,null,null,null,null,null,null,null,null,"",""]
[null,null,null,null,null,null,null,null,null,null,null,null,null,null,null,null,null,null,null,null,null,null,null,null,null,null,null,null,null,null,null,null,null,null,null,null,null,null,null,null,"",""]
[null,null,null,null,null,null,null,null,null,null,null,null,null,null,null,null,null,null,null,null,null,null,null,null,null,null,null,null,null,null,null,null,null,null,null,null,null,null,null,null,"",""]
[null,null,null,null,null,null,null,null,null,null,null,null,null,null,null,null,null,null,null,null,null,null,null,null,null,null,null,null,null,null,null,null,null,null,null,null,null,null,null,null,"",""]
[null,null,null,null,null,null,null,null,null,null,null,null,null,null,null,null,null,null,null,null,null,null,null,null,null,null,null,null,null,null,null,null,null,null,null,null,null,null,null,null,"",""]
[null,null,null,null,null,null,null,null,null,null,null,null,null,null,null,null,null,null,null,null,null,null,null,null,null,null,null,null,null,null,null,null,null,null,null,null,null,null,null,null,"",""]
[null,null,null,null,null,null,null,null,null,null,null,null,null,null,null,null,null,null,null,null,null,null,null,null,null,null,null,null,null,null,null,null,null,null,null,null,null,null,null,null,"",""]
[null,null,null,null,null,null,null,null,null,null,null,null,null,null,null,null,null,null,null,null,null,null,null,null,null,null,null,null,null,null,null,null,null,null,null,null,null,null,null,null,"",""]
[null,null,null,null,null,null,null,null,null,null,null,null,null,null,null,null,null,null,null,null,null,null,null,null,null,null,null,null,null,null,null,null,null,null,null,null,null,null,null,null,"",""]
[null,null,null,null,null,null,null,null,null,null,null,null,null,null,null,null,null,null,null,null,null,null,null,null,null,null,null,null,null,null,null,null,null,null,null,null,null,null,null,null,"",""]
[null,null,null,null,null,null,null,null,null,null,null,null,null,null,null,null,null,null,null,null,null,null,null,null,null,null,null,null,null,null,null,null,null,null,null,null,null,null,null,null,"",""]
[null,null,null,null,null,null,null,null,null,null,null,null,null,null,null,null,null,null,null,null,null,null,null,null,null,null,null,null,null,null,null,null,null,null,null,null,null,null,null,null,"",""]
[null,null,null,null,null,null,null,null,null,null,null,null,null,null,null,null,null,null,null,null,null,null,null,null,null,null,null,null,null,null,null,null,null,null,null,null,null,null,null,null,"",""]
[null,null,null,null,null,null,null,null,null,null,null,null,null,null,null,null,null,null,null,null,null,null,null,null,null,null,null,null,null,null,null,null,null,null,null,null,null,null,null,null,"",""]
[null,null,null,null,null,null,null,null,null,null,null,null,null,null,null,null,null,null,null,null,null,null,null,null,null,null,null,null,null,null,null,null,null,null,null,null,null,null,null,null,"",""]
[null,null,null,null,null,null,null,null,null,null,null,null,null,null,null,null,null,null,null,null,null,null,null,null,null,null,null,null,null,null,null,null,null,null,null,null,null,null,null,null,"",""]
[null,null,null,null,null,null,null,null,null,null,null,null,null,null,null,null,null,null,null,null,null,null,null,null,null,null,null,null,null,null,null,null,null,null,null,null,null,null,null,null,"",""]
[null,null,null,null,null,null,null,null,null,null,null,null,null,null,null,null,null,null,null,null,null,null,null,null,null,null,null,null,null,null,null,null,null,null,null,null,null,null,null,null,"",""]
[null,null,null,null,null,null,null,null,null,null,null,null,null,null,null,null,null,null,null,null,null,null,null,null,null,null,null,null,null,null,null,null,null,null,null,null,null,null,null,null,"",""]
[null,null,null,null,null,null,null,null,null,null,null,null,null,null,null,null,null,null,null,null,null,null,null,null,null,null,null,null,null,null,null,null,null,null,null,null,null,null,null,null,"",""]
[null,null,null,null,null,null,null,null,null,null,null,null,null,null,null,null,null,null,null,null,null,null,null,null,null,null,null,null,null,null,null,null,null,null,null,null,null,null,null,null,"",""]
[null,null,null,null,null,null,null,null,null,null,null,null,null,null,null,null,null,null,null,null,null,null,null,null,null,null,null,null,null,null,null,null,null,null,null,null,null,null,null,null,{"$f":"IF(AN517=\"\",\"\",IFERROR(MATCH(AN517,$AD$4:$AD$1000,0),_xlfn.XLOOKUP(AN517,$Y$4:$Y$1000,$AA$4:$AA$1000,\"\",0)))","v":""},""]
[null,null,null,null,null,null,null,null,null,null,null,null,null,null,null,null,null,null,null,null,null,null,null,null,null,null,null,null,null,null,null,null,null,null,null,null,null,null,null,null,"",""]
[null,null,null,null,null,null,null,null,null,null,null,null,null,null,null,null,null,null,null,null,null,null,null,null,null,null,null,null,null,null,null,null,null,null,null,null,null,null,null,null,"",""]
[null,null,null,null,null,null,null,null,null,null,null,null,null,null,null,null,null,null,null,null,null,null,null,null,null,null,null,null,null,null,null,null,null,null,null,null,null,null,null,null,"",""]
[null,null,null,null,null,null,null,null,null,null,null,null,null,null,null,null,null,null,null,null,null,null,null,null,null,null,null,null,null,null,null,null,null,null,null,null,null,null,null,null,"",""]
[null,null,null,null,null,null,null,null,null,null,null,null,null,null,null,null,null,null,null,null,null,null,null,null,null,null,null,null,null,null,null,null,null,null,null,null,null,null,null,null,"",""]
[null,null,null,null,null,null,null,null,null,null,null,null,null,null,null,null,null,null,null,null,null,null,null,null,null,null,null,null,null,null,null,null,null,null,null,null,null,null,null,null,"",""]
[null,null,null,null,null,null,null,null,null,null,null,null,null,null,null,null,null,null,null,null,null,null,null,null,null,null,null,null,null,null,null,null,null,null,null,null,null,null,null,null,"",""]
[null,null,null,null,null,null,null,null,null,null,null,null,null,null,null,null,null,null,null,null,null,null,null,null,null,null,null,null,null,null,null,null,null,null,null,null,null,null,null,null,"",""]
[null,null,null,null,null,null,null,null,null,null,null,null,null,null,null,null,null,null,null,null,null,null,null,null,null,null,null,null,null,null,null,null,null,null,null,null,null,null,null,null,"",""]
[null,null,null,null,null,null,null,null,null,null,null,null,null,null,null,null,null,null,null,null,null,null,null,null,null,null,null,null,null,null,null,null,null,null,null,null,null,null,null,null,"",""]
[null,null,null,null,null,null,null,null,null,null,null,null,null,null,null,null,null,null,null,null,null,null,null,null,null,null,null,null,null,null,null,null,null,null,null,null,null,null,null,null,"",""]
[null,null,null,null,null,null,null,null,null,null,null,null,null,null,null,null,null,null,null,null,null,null,null,null,null,null,null,null,null,null,null,null,null,null,null,null,null,null,null,null,"",""]
[null,null,null,null,null,null,null,null,null,null,null,null,null,null,null,null,null,null,null,null,null,null,null,null,null,null,null,null,null,null,null,null,null,null,null,null,null,null,null,null,"",""]
[null,null,null,null,null,null,null,null,null,null,null,null,null,null,null,null,null,null,null,null,null,null,null,null,null,null,null,null,null,null,null,null,null,null,null,null,null,null,null,null,"",""]
[null,null,null,null,null,null,null,null,null,null,null,null,null,null,null,null,null,null,null,null,null,null,null,null,null,null,null,null,null,null,null,null,null,null,null,null,null,null,null,null,"",""]
[null,null,null,null,null,null,null,null,null,null,null,null,null,null,null,null,null,null,null,null,null,null,null,null,null,null,null,null,null,null,null,null,null,null,null,null,null,null,null,null,"",""]
[null,null,null,null,null,null,null,null,null,null,null,null,null,null,null,null,null,null,null,null,null,null,null,null,null,null,null,null,null,null,null,null,null,null,null,null,null,null,null,null,"",{"$f":"IF(AN534=\"\",\"\",IF(N(AO534)=0,AO534,AM534))","v":""}]
[null,null,null,null,null,null,null,null,null,null,null,null,null,null,null,null,null,null,null,null,null,null,null,null,null,null,null,null,null,null,null,null,null,null,null,null,null,null,null,null,"",""]
[null,null,null,null,null,null,null,null,null,null,null,null,null,null,null,null,null,null,null,null,null,null,null,null,null,null,null,null,null,null,null,null,null,null,null,null,null,null,null,null,"",""]
[null,null,null,null,null,null,null,null,null,null,null,null,null,null,null,null,null,null,null,null,null,null,null,null,null,null,null,null,null,null,null,null,null,null,null,null,null,null,null,null,"",""]
[null,null,null,null,null,null,null,null,null,null,null,null,null,null,null,null,null,null,null,null,null,null,null,null,null,null,null,null,null,null,null,null,null,null,null,null,null,null,null,null,"",""]
[null,null,null,null,null,null,null,null,null,null,null,null,null,null,null,null,null,null,null,null,null,null,null,null,null,null,null,null,null,null,null,null,null,null,null,null,null,null,null,null,"",""]
[null,null,null,null,null,null,null,null,null,null,null,null,null,null,null,null,null,null,null,null,null,null,null,null,null,null,null,null,null,null,null,null,null,null,null,null,null,null,null,null,"",""]
[null,null,null,null,null,null,null,null,null,null,null,null,null,null,null,null,null,null,null,null,null,null,null,null,null,null,null,null,null,null,null,null,null,null,null,null,null,null,null,null,"",""]
[null,null,null,null,null,null,null,null,null,null,null,null,null,null,null,null,null,null,null,null,null,null,null,null,null,null,null,null,null,null,null,null,null,null,null,null,null,null,null,null,"",""]
[null,null,null,null,null,null,null,null,null,null,null,null,null,null,null,null,null,null,null,null,null,null,null,null,null,null,null,null,null,null,null,null,null,null,null,null,null,null,null,null,"",""]
[null,null,null,null,null,null,null,null,null,null,null,null,null,null,null,null,null,null,null,null,null,null,null,null,null,null,null,null,null,null,null,null,null,null,null,null,null,null,null,null,"",""]
[null,null,null,null,null,null,null,null,null,null,null,null,null,null,null,null,null,null,null,null,null,null,null,null,null,null,null,null,null,null,null,null,null,null,null,null,null,null,null,null,"",""]
[null,null,null,null,null,null,null,null,null,null,null,null,null,null,null,null,null,null,null,null,null,null,null,null,null,null,null,null,null,null,null,null,null,null,null,null,null,null,null,null,"",""]
[null,null,null,null,null,null,null,null,null,null,null,null,null,null,null,null,null,null,null,null,null,null,null,null,null,null,null,null,null,null,null,null,null,null,null,null,null,null,null,null,"",""]
[null,null,null,null,null,null,null,null,null,null,null,null,null,null,null,null,null,null,null,null,null,null,null,null,null,null,null,null,null,null,null,null,null,null,null,null,null,null,null,null,"",""]
[null,null,null,null,null,null,null,null,null,null,null,null,null,null,null,null,null,null,null,null,null,null,null,null,null,null,null,null,null,null,null,null,null,null,null,null,null,null,null,null,"",""]
[null,null,null,null,null,null,null,null,null,null,null,null,null,null,null,null,null,null,null,null,null,null,null,null,null,null,null,null,null,null,null,null,null,null,null,null,null,null,null,null,"",""]
[null,null,null,null,null,null,null,null,null,null,null,null,null,null,null,null,null,null,null,null,null,null,null,null,null,null,null,null,null,null,null,null,null,null,null,null,null,null,null,null,"",""]
[null,null,null,null,null,null,null,null,null,null,null,null,null,null,null,null,null,null,null,null,null,null,null,null,null,null,null,null,null,null,null,null,null,null,null,null,null,null,null,null,"",""]
[null,null,null,null,null,null,null,null,null,null,null,null,null,null,null,null,null,null,null,null,null,null,null,null,null,null,null,null,null,null,null,null,null,null,null,null,null,null,null,null,"",""]
[null,null,null,null,null,null,null,null,null,null,null,null,null,null,null,null,null,null,null,null,null,null,null,null,null,null,null,null,null,null,null,null,null,null,null,null,null,null,null,null,"",""]
[null,null,null,null,null,null,null,null,null,null,null,null,null,null,null,null,null,null,null,null,null,null,null,null,null,null,null,null,null,null,null,null,null,null,null,null,null,null,null,null,"",""]
[null,null,null,null,null,null,null,null,null,null,null,null,null,null,null,null,null,null,null,null,null,null,null,null,null,null,null,null,null,null,null,null,null,null,null,null,null,null,null,null,"",""]
[null,null,null,null,null,null,null,null,null,null,null,null,null,null,null,null,null,null,null,null,null,null,null,null,null,null,null,null,null,null,null,null,null,null,null,null,null,null,null,null,"",""]
[null,null,null,null,null,null,null,null,null,null,null,null,null,null,null,null,null,null,null,null,null,null,null,null,null,null,null,null,null,null,null,null,null,null,null,null,null,null,null,null,"",""]
[null,null,null,null,null,null,null,null,null,null,null,null,null,null,null,null,null,null,null,null,null,null,null,null,null,null,null,null,null,null,null,null,null,null,null,null,null,null,null,null,"",""]
[null,null,null,null,null,null,null,null,null,null,null,null,null,null,null,null,null,null,null,null,null,null,null,null,null,null,null,null,null,null,null,null,null,null,null,null,null,null,null,null,"",""]
[null,null,null,null,null,null,null,null,null,null,null,null,null,null,null,null,null,null,null,null,null,null,null,null,null,null,null,null,null,null,null,null,null,null,null,null,null,null,null,null,"",""]
[null,null,null,null,null,null,null,null,null,null,null,null,null,null,null,null,null,null,null,null,null,null,null,null,null,null,null,null,null,null,null,null,null,null,null,null,null,null,null,null,"",""]
[null,null,null,null,null,null,null,null,null,null,null,null,null,null,null,null,null,null,null,null,null,null,null,null,null,null,null,null,null,null,null,null,null,null,null,null,null,null,null,null,"",""]
[null,null,null,null,null,null,null,null,null,null,null,null,null,null,null,null,null,null,null,null,null,null,null,null,null,null,null,null,null,null,null,null,null,null,null,null,null,null,null,null,"",""]
[null,null,null,null,null,null,null,null,null,null,null,null,null,null,null,null,null,null,null,null,null,null,null,null,null,null,null,null,null,null,null,null,null,null,null,null,null,null,null,null,"",""]
[null,null,null,null,null,null,null,null,null,null,null,null,null,null,null,null,null,null,null,null,null,null,null,null,null,null,null,null,null,null,null,null,null,null,null,null,null,null,null,null,"",""]
[null,null,null,null,null,null,null,null,null,null,null,null,null,null,null,null,null,null,null,null,null,null,null,null,null,null,null,null,null,null,null,null,null,null,null,null,null,null,null,null,"",""]
[null,null,null,null,null,null,null,null,null,null,null,null,null,null,null,null,null,null,null,null,null,null,null,null,null,null,null,null,null,null,null,null,null,null,null,null,null,null,null,null,"",""]
[null,null,null,null,null,null,null,null,null,null,null,null,null,null,null,null,null,null,null,null,null,null,null,null,null,null,null,null,null,null,null,null,null,null,null,null,null,null,null,null,"",""]
[null,null,null,null,null,null,null,null,null,null,null,null,null,null,null,null,null,null,null,null,null,null,null,null,null,null,null,null,null,null,null,null,null,null,null,null,null,null,null,null,"",""]
[null,null,null,null,null,null,null,null,null,null,null,null,null,null,null,null,null,null,null,null,null,null,null,null,null,null,null,null,null,null,null,null,null,null,null,null,null,null,null,null,"",""]
[null,null,null,null,null,null,null,null,null,null,null,null,null,null,null,null,null,null,null,null,null,null,null,null,null,null,null,null,null,null,null,null,null,null,null,null,null,null,null,null,"",""]
[null,null,null,null,null,null,null,null,null,null,null,null,null,null,null,null,null,null,null,null,null,null,null,null,null,null,null,null,null,null,null,null,null,null,null,null,null,null,null,null,"",""]
[null,null,null,null,null,null,null,null,null,null,null,null,null,null,null,null,null,null,null,null,null,null,null,null,null,null,null,null,null,null,null,null,null,null,null,null,null,null,null,null,"",""]
[null,null,null,null,null,null,null,null,null,null,null,null,null,null,null,null,null,null,null,null,null,null,null,null,null,null,null,null,null,null,null,null,null,null,null,null,null,null,null,null,"",""]
[null,null,null,null,null,null,null,null,null,null,null,null,null,null,null,null,null,null,null,null,null,null,null,null,null,null,null,null,null,null,null,null,null,null,null,null,null,null,null,null,"",""]
[null,null,null,null,null,null,null,null,null,null,null,null,null,null,null,null,null,null,null,null,null,null,null,null,null,null,null,null,null,null,null,null,null,null,null,null,null,null,null,null,"",""]
[null,null,null,null,null,null,null,null,null,null,null,null,null,null,null,null,null,null,null,null,null,null,null,null,null,null,null,null,null,null,null,null,null,null,null,null,null,null,null,null,"",""]
[null,null,null,null,null,null,null,null,null,null,null,null,null,null,null,null,null,null,null,null,null,null,null,null,null,null,null,null,null,null,null,null,null,null,null,null,null,null,null,null,"",""]
[null,null,null,null,null,null,null,null,null,null,null,null,null,null,null,null,null,null,null,null,null,null,null,null,null,null,null,null,null,null,null,null,null,null,null,null,null,null,null,null,"",""]
[null,null,null,null,null,null,null,null,null,null,null,null,null,null,null,null,null,null,null,null,null,null,null,null,null,null,null,null,null,null,null,null,null,null,null,null,null,null,null,null,{"$f":"IF(AN581=\"\",\"\",IFERROR(MATCH(AN581,$AD$4:$AD$1000,0),_xlfn.XLOOKUP(AN581,$Y$4:$Y$1000,$AA$4:$AA$1000,\"\",0)))","v":""},""]
[null,null,null,null,null,null,null,null,null,null,null,null,null,null,null,null,null,null,null,null,null,null,null,null,null,null,null,null,null,null,null,null,null,null,null,null,null,null,null,null,"",""]
[null,null,null,null,null,null,null,null,null,null,null,null,null,null,null,null,null,null,null,null,null,null,null,null,null,null,null,null,null,null,null,null,null,null,null,null,null,null,null,null,"",""]
[null,null,null,null,null,null,null,null,null,null,null,null,null,null,null,null,null,null,null,null,null,null,null,null,null,null,null,null,null,null,null,null,null,null,null,null,null,null,null,null,"",""]
[null,null,null,null,null,null,null,null,null,null,null,null,null,null,null,null,null,null,null,null,null,null,null,null,null,null,null,null,null,null,null,null,null,null,null,null,null,null,null,null,"",""]
[null,null,null,null,null,null,null,null,null,null,null,null,null,null,null,null,null,null,null,null,null,null,null,null,null,null,null,null,null,null,null,null,null,null,null,null,null,null,null,null,"",""]
[null,null,null,null,null,null,null,null,null,null,null,null,null,null,null,null,null,null,null,null,null,null,null,null,null,null,null,null,null,null,null,null,null,null,null,null,null,null,null,null,"",""]
[null,null,null,null,null,null,null,null,null,null,null,null,null,null,null,null,null,null,null,null,null,null,null,null,null,null,null,null,null,null,null,null,null,null,null,null,null,null,null,null,"",""]
[null,null,null,null,null,null,null,null,null,null,null,null,null,null,null,null,null,null,null,null,null,null,null,null,null,null,null,null,null,null,null,null,null,null,null,null,null,null,null,null,"",""]
[null,null,null,null,null,null,null,null,null,null,null,null,null,null,null,null,null,null,null,null,null,null,null,null,null,null,null,null,null,null,null,null,null,null,null,null,null,null,null,null,"",""]
[null,null,null,null,null,null,null,null,null,null,null,null,null,null,null,null,null,null,null,null,null,null,null,null,null,null,null,null,null,null,null,null,null,null,null,null,null,null,null,null,"",""]
[null,null,null,null,null,null,null,null,null,null,null,null,null,null,null,null,null,null,null,null,null,null,null,null,null,null,null,null,null,null,null,null,null,null,null,null,null,null,null,null,"",""]
[null,null,null,null,null,null,null,null,null,null,null,null,null,null,null,null,null,null,null,null,null,null,null,null,null,null,null,null,null,null,null,null,null,null,null,null,null,null,null,null,"",""]
[null,null,null,null,null,null,null,null,null,null,null,null,null,null,null,null,null,null,null,null,null,null,null,null,null,null,null,null,null,null,null,null,null,null,null,null,null,null,null,null,"",""]
[null,null,null,null,null,null,null,null,null,null,null,null,null,null,null,null,null,null,null,null,null,null,null,null,null,null,null,null,null,null,null,null,null,null,null,null,null,null,null,null,"",""]
[null,null,null,null,null,null,null,null,null,null,null,null,null,null,null,null,null,null,null,null,null,null,null,null,null,null,null,null,null,null,null,null,null,null,null,null,null,null,null,null,"",""]
[null,null,null,null,null,null,null,null,null,null,null,null,null,null,null,null,null,null,null,null,null,null,null,null,null,null,null,null,null,null,null,null,null,null,null,null,null,null,null,null,"",""]
[null,null,null,null,null,null,null,null,null,null,null,null,null,null,null,null,null,null,null,null,null,null,null,null,null,null,null,null,null,null,null,null,null,null,null,null,null,null,null,null,"",{"$f":"IF(AN598=\"\",\"\",IF(N(AO598)=0,AO598,AM598))","v":""}]
[null,null,null,null,null,null,null,null,null,null,null,null,null,null,null,null,null,null,null,null,null,null,null,null,null,null,null,null,null,null,null,null,null,null,null,null,null,null,null,null,"",""]
[null,null,null,null,null,null,null,null,null,null,null,null,null,null,null,null,null,null,null,null,null,null,null,null,null,null,null,null,null,null,null,null,null,null,null,null,null,null,null,null,"",""]
[null,null,null,null,null,null,null,null,null,null,null,null,null,null,null,null,null,null,null,null,null,null,null,null,null,null,null,null,null,null,null,null,null,null,null,null,null,null,null,null,"",""]
[null,null,null,null,null,null,null,null,null,null,null,null,null,null,null,null,null,null,null,null,null,null,null,null,null,null,null,null,null,null,null,null,null,null,null,null,null,null,null,null,"",""]
[null,null,null,null,null,null,null,null,null,null,null,null,null,null,null,null,null,null,null,null,null,null,null,null,null,null,null,null,null,null,null,null,null,null,null,null,null,null,null,null,"",""]
[null,null,null,null,null,null,null,null,null,null,null,null,null,null,null,null,null,null,null,null,null,null,null,null,null,null,null,null,null,null,null,null,null,null,null,null,null,null,null,null,"",""]
[null,null,null,null,null,null,null,null,null,null,null,null,null,null,null,null,null,null,null,null,null,null,null,null,null,null,null,null,null,null,null,null,null,null,null,null,null,null,null,null,"",""]
[null,null,null,null,null,null,null,null,null,null,null,null,null,null,null,null,null,null,null,null,null,null,null,null,null,null,null,null,null,null,null,null,null,null,null,null,null,null,null,null,"",""]
[null,null,null,null,null,null,null,null,null,null,null,null,null,null,null,null,null,null,null,null,null,null,null,null,null,null,null,null,null,null,null,null,null,null,null,null,null,null,null,null,"",""]
[null,null,null,null,null,null,null,null,null,null,null,null,null,null,null,null,null,null,null,null,null,null,null,null,null,null,null,null,null,null,null,null,null,null,null,null,null,null,null,null,"",""]
[null,null,null,null,null,null,null,null,null,null,null,null,null,null,null,null,null,null,null,null,null,null,null,null,null,null,null,null,null,null,null,null,null,null,null,null,null,null,null,null,"",""]
[null,null,null,null,null,null,null,null,null,null,null,null,null,null,null,null,null,null,null,null,null,null,null,null,null,null,null,null,null,null,null,null,null,null,null,null,null,null,null,null,"",""]
[null,null,null,null,null,null,null,null,null,null,null,null,null,null,null,null,null,null,null,null,null,null,null,null,null,null,null,null,null,null,null,null,null,null,null,null,null,null,null,null,"",""]
[null,null,null,null,null,null,null,null,null,null,null,null,null,null,null,null,null,null,null,null,null,null,null,null,null,null,null,null,null,null,null,null,null,null,null,null,null,null,null,null,"",""]
[null,null,null,null,null,null,null,null,null,null,null,null,null,null,null,null,null,null,null,null,null,null,null,null,null,null,null,null,null,null,null,null,null,null,null,null,null,null,null,null,"",""]
[null,null,null,null,null,null,null,null,null,null,null,null,null,null,null,null,null,null,null,null,null,null,null,null,null,null,null,null,null,null,null,null,null,null,null,null,null,null,null,null,"",""]
[null,null,null,null,null,null,null,null,null,null,null,null,null,null,null,null,null,null,null,null,null,null,null,null,null,null,null,null,null,null,null,null,null,null,null,null,null,null,null,null,"",""]
[null,null,null,null,null,null,null,null,null,null,null,null,null,null,null,null,null,null,null,null,null,null,null,null,null,null,null,null,null,null,null,null,null,null,null,null,null,null,null,null,"",""]
[null,null,null,null,null,null,null,null,null,null,null,null,null,null,null,null,null,null,null,null,null,null,null,null,null,null,null,null,null,null,null,null,null,null,null,null,null,null,null,null,"",""]
[null,null,null,null,null,null,null,null,null,null,null,null,null,null,null,null,null,null,null,null,null,null,null,null,null,null,null,null,null,null,null,null,null,null,null,null,null,null,null,null,"",""]
[null,null,null,null,null,null,null,null,null,null,null,null,null,null,null,null,null,null,null,null,null,null,null,null,null,null,null,null,null,null,null,null,null,null,null,null,null,null,null,null,"",""]
[null,null,null,null,null,null,null,null,null,null,null,null,null,null,null,null,null,null,null,null,null,null,null,null,null,null,null,null,null,null,null,null,null,null,null,null,null,null,null,null,"",""]
[null,null,null,null,null,null,null,null,null,null,null,null,null,null,null,null,null,null,null,null,null,null,null,null,null,null,null,null,null,null,null,null,null,null,null,null,null,null,null,null,"",""]
[null,null,null,null,null,null,null,null,null,null,null,null,null,null,null,null,null,null,null,null,null,null,null,null,null,null,null,null,null,null,null,null,null,null,null,null,null,null,null,null,"",""]
[null,null,null,null,null,null,null,null,null,null,null,null,null,null,null,null,null,null,null,null,null,null,null,null,null,null,null,null,null,null,null,null,null,null,null,null,null,null,null,null,"",""]
[null,null,null,null,null,null,null,null,null,null,null,null,null,null,null,null,null,null,null,null,null,null,null,null,null,null,null,null,null,null,null,null,null,null,null,null,null,null,null,null,"",""]
[null,null,null,null,null,null,null,null,null,null,null,null,null,null,null,null,null,null,null,null,null,null,null,null,null,null,null,null,null,null,null,null,null,null,null,null,null,null,null,null,"",""]
[null,null,null,null,null,null,null,null,null,null,null,null,null,null,null,null,null,null,null,null,null,null,null,null,null,null,null,null,null,null,null,null,null,null,null,null,null,null,null,null,"",""]
[null,null,null,null,null,null,null,null,null,null,null,null,null,null,null,null,null,null,null,null,null,null,null,null,null,null,null,null,null,null,null,null,null,null,null,null,null,null,null,null,"",""]
[null,null,null,null,null,null,null,null,null,null,null,null,null,null,null,null,null,null,null,null,null,null,null,null,null,null,null,null,null,null,null,null,null,null,null,null,null,null,null,null,"",""]
[null,null,null,null,null,null,null,null,null,null,null,null,null,null,null,null,null,null,null,null,null,null,null,null,null,null,null,null,null,null,null,null,null,null,null,null,null,null,null,null,"",""]
[null,null,null,null,null,null,null,null,null,null,null,null,null,null,null,null,null,null,null,null,null,null,null,null,null,null,null,null,null,null,null,null,null,null,null,null,null,null,null,null,"",""]
[null,null,null,null,null,null,null,null,null,null,null,null,null,null,null,null,null,null,null,null,null,null,null,null,null,null,null,null,null,null,null,null,null,null,null,null,null,null,null,null,"",""]
[null,null,null,null,null,null,null,null,null,null,null,null,null,null,null,null,null,null,null,null,null,null,null,null,null,null,null,null,null,null,null,null,null,null,null,null,null,null,null,null,"",""]
[null,null,null,null,null,null,null,null,null,null,null,null,null,null,null,null,null,null,null,null,null,null,null,null,null,null,null,null,null,null,null,null,null,null,null,null,null,null,null,null,"",""]
[null,null,null,null,null,null,null,null,null,null,null,null,null,null,null,null,null,null,null,null,null,null,null,null,null,null,null,null,null,null,null,null,null,null,null,null,null,null,null,null,"",""]
[null,null,null,null,null,null,null,null,null,null,null,null,null,null,null,null,null,null,null,null,null,null,null,null,null,null,null,null,null,null,null,null,null,null,null,null,null,null,null,null,"",""]
[null,null,null,null,null,null,null,null,null,null,null,null,null,null,null,null,null,null,null,null,null,null,null,null,null,null,null,null,null,null,null,null,null,null,null,null,null,null,null,null,"",""]
[null,null,null,null,null,null,null,null,null,null,null,null,null,null,null,null,null,null,null,null,null,null,null,null,null,null,null,null,null,null,null,null,null,null,null,null,null,null,null,null,"",""]
[null,null,null,null,null,null,null,null,null,null,null,null,null,null,null,null,null,null,null,null,null,null,null,null,null,null,null,null,null,null,null,null,null,null,null,null,null,null,null,null,"",""]
[null,null,null,null,null,null,null,null,null,null,null,null,null,null,null,null,null,null,null,null,null,null,null,null,null,null,null,null,null,null,null,null,null,null,null,null,null,null,null,null,"",""]
[null,null,null,null,null,null,null,null,null,null,null,null,null,null,null,null,null,null,null,null,null,null,null,null,null,null,null,null,null,null,null,null,null,null,null,null,null,null,null,null,"",""]
[null,null,null,null,null,null,null,null,null,null,null,null,null,null,null,null,null,null,null,null,null,null,null,null,null,null,null,null,null,null,null,null,null,null,null,null,null,null,null,null,"",""]
[null,null,null,null,null,null,null,null,null,null,null,null,null,null,null,null,null,null,null,null,null,null,null,null,null,null,null,null,null,null,null,null,null,null,null,null,null,null,null,null,"",""]
[null,null,null,null,null,null,null,null,null,null,null,null,null,null,null,null,null,null,null,null,null,null,null,null,null,null,null,null,null,null,null,null,null,null,null,null,null,null,null,null,"",""]
[null,null,null,null,null,null,null,null,null,null,null,null,null,null,null,null,null,null,null,null,null,null,null,null,null,null,null,null,null,null,null,null,null,null,null,null,null,null,null,null,"",""]
[null,null,null,null,null,null,null,null,null,null,null,null,null,null,null,null,null,null,null,null,null,null,null,null,null,null,null,null,null,null,null,null,null,null,null,null,null,null,null,null,{"$f":"IF(AN645=\"\",\"\",IFERROR(MATCH(AN645,$AD$4:$AD$1000,0),_xlfn.XLOOKUP(AN645,$Y$4:$Y$1000,$AA$4:$AA$1000,\"\",0)))","v":""},""]
[null,null,null,null,null,null,null,null,null,null,null,null,null,null,null,null,null,null,null,null,null,null,null,null,null,null,null,null,null,null,null,null,null,null,null,null,null,null,null,null,"",""]
[null,null,null,null,null,null,null,null,null,null,null,null,null,null,null,null,null,null,null,null,null,null,null,null,null,null,null,null,null,null,null,null,null,null,null,null,null,null,null,null,"",""]
[null,null,null,null,null,null,null,null,null,null,null,null,null,null,null,null,null,null,null,null,null,null,null,null,null,null,null,null,null,null,null,null,null,null,null,null,null,null,null,null,"",""]
[null,null,null,null,null,null,null,null,null,null,null,null,null,null,null,null,null,null,null,null,null,null,null,null,null,null,null,null,null,null,null,null,null,null,null,null,null,null,null,null,"",""]
[null,null,null,null,null,null,null,null,null,null,null,null,null,null,null,null,null,null,null,null,null,null,null,null,null,null,null,null,null,null,null,null,null,null,null,null,null,null,null,null,"",""]
[null,null,null,null,null,null,null,null,null,null,null,null,null,null,null,null,null,null,null,null,null,null,null,null,null,null,null,null,null,null,null,null,null,null,null,null,null,null,null,null,"",""]
[null,null,null,null,null,null,null,null,null,null,null,null,null,null,null,null,null,null,null,null,null,null,null,null,null,null,null,null,null,null,null,null,null,null,null,null,null,null,null,null,"",""]
[null,null,null,null,null,null,null,null,null,null,null,null,null,null,null,null,null,null,null,null,null,null,null,null,null,null,null,null,null,null,null,null,null,null,null,null,null,null,null,null,"",""]
[null,null,null,null,null,null,null,null,null,null,null,null,null,null,null,null,null,null,null,null,null,null,null,null,null,null,null,null,null,null,null,null,null,null,null,null,null,null,null,null,"",""]
[null,null,null,null,null,null,null,null,null,null,null,null,null,null,null,null,null,null,null,null,null,null,null,null,null,null,null,null,null,null,null,null,null,null,null,null,null,null,null,null,"",""]
[null,null,null,null,null,null,null,null,null,null,null,null,null,null,null,null,null,null,null,null,null,null,null,null,null,null,null,null,null,null,null,null,null,null,null,null,null,null,null,null,"",""]
[null,null,null,null,null,null,null,null,null,null,null,null,null,null,null,null,null,null,null,null,null,null,null,null,null,null,null,null,null,null,null,null,null,null,null,null,null,null,null,null,"",""]
[null,null,null,null,null,null,null,null,null,null,null,null,null,null,null,null,null,null,null,null,null,null,null,null,null,null,null,null,null,null,null,null,null,null,null,null,null,null,null,null,"",""]
[null,null,null,null,null,null,null,null,null,null,null,null,null,null,null,null,null,null,null,null,null,null,null,null,null,null,null,null,null,null,null,null,null,null,null,null,null,null,null,null,"",""]
[null,null,null,null,null,null,null,null,null,null,null,null,null,null,null,null,null,null,null,null,null,null,null,null,null,null,null,null,null,null,null,null,null,null,null,null,null,null,null,null,"",""]
[null,null,null,null,null,null,null,null,null,null,null,null,null,null,null,null,null,null,null,null,null,null,null,null,null,null,null,null,null,null,null,null,null,null,null,null,null,null,null,null,"",""]
[null,null,null,null,null,null,null,null,null,null,null,null,null,null,null,null,null,null,null,null,null,null,null,null,null,null,null,null,null,null,null,null,null,null,null,null,null,null,null,null,"",{"$f":"IF(AN662=\"\",\"\",IF(N(AO662)=0,AO662,AM662))","v":""}]
[null,null,null,null,null,null,null,null,null,null,null,null,null,null,null,null,null,null,null,null,null,null,null,null,null,null,null,null,null,null,null,null,null,null,null,null,null,null,null,null,"",""]
[null,null,null,null,null,null,null,null,null,null,null,null,null,null,null,null,null,null,null,null,null,null,null,null,null,null,null,null,null,null,null,null,null,null,null,null,null,null,null,null,"",""]
[null,null,null,null,null,null,null,null,null,null,null,null,null,null,null,null,null,null,null,null,null,null,null,null,null,null,null,null,null,null,null,null,null,null,null,null,null,null,null,null,"",""]
[null,null,null,null,null,null,null,null,null,null,null,null,null,null,null,null,null,null,null,null,null,null,null,null,null,null,null,null,null,null,null,null,null,null,null,null,null,null,null,null,"",""]
[null,null,null,null,null,null,null,null,null,null,null,null,null,null,null,null,null,null,null,null,null,null,null,null,null,null,null,null,null,null,null,null,null,null,null,null,null,null,null,null,"",""]
[null,null,null,null,null,null,null,null,null,null,null,null,null,null,null,null,null,null,null,null,null,null,null,null,null,null,null,null,null,null,null,null,null,null,null,null,null,null,null,null,"",""]
[null,null,null,null,null,null,null,null,null,null,null,null,null,null,null,null,null,null,null,null,null,null,null,null,null,null,null,null,null,null,null,null,null,null,null,null,null,null,null,null,"",""]
[null,null,null,null,null,null,null,null,null,null,null,null,null,null,null,null,null,null,null,null,null,null,null,null,null,null,null,null,null,null,null,null,null,null,null,null,null,null,null,null,"",""]
[null,null,null,null,null,null,null,null,null,null,null,null,null,null,null,null,null,null,null,null,null,null,null,null,null,null,null,null,null,null,null,null,null,null,null,null,null,null,null,null,"",""]
[null,null,null,null,null,null,null,null,null,null,null,null,null,null,null,null,null,null,null,null,null,null,null,null,null,null,null,null,null,null,null,null,null,null,null,null,null,null,null,null,"",""]
[null,null,null,null,null,null,null,null,null,null,null,null,null,null,null,null,null,null,null,null,null,null,null,null,null,null,null,null,null,null,null,null,null,null,null,null,null,null,null,null,"",""]
[null,null,null,null,null,null,null,null,null,null,null,null,null,null,null,null,null,null,null,null,null,null,null,null,null,null,null,null,null,null,null,null,null,null,null,null,null,null,null,null,"",""]
[null,null,null,null,null,null,null,null,null,null,null,null,null,null,null,null,null,null,null,null,null,null,null,null,null,null,null,null,null,null,null,null,null,null,null,null,null,null,null,null,"",""]
[null,null,null,null,null,null,null,null,null,null,null,null,null,null,null,null,null,null,null,null,null,null,null,null,null,null,null,null,null,null,null,null,null,null,null,null,null,null,null,null,"",""]
[null,null,null,null,null,null,null,null,null,null,null,null,null,null,null,null,null,null,null,null,null,null,null,null,null,null,null,null,null,null,null,null,null,null,null,null,null,null,null,null,"",""]
[null,null,null,null,null,null,null,null,null,null,null,null,null,null,null,null,null,null,null,null,null,null,null,null,null,null,null,null,null,null,null,null,null,null,null,null,null,null,null,null,"",""]
[null,null,null,null,null,null,null,null,null,null,null,null,null,null,null,null,null,null,null,null,null,null,null,null,null,null,null,null,null,null,null,null,null,null,null,null,null,null,null,null,"",""]
[null,null,null,null,null,null,null,null,null,null,null,null,null,null,null,null,null,null,null,null,null,null,null,null,null,null,null,null,null,null,null,null,null,null,null,null,null,null,null,null,"",""]
[null,null,null,null,null,null,null,null,null,null,null,null,null,null,null,null,null,null,null,null,null,null,null,null,null,null,null,null,null,null,null,null,null,null,null,null,null,null,null,null,"",""]
[null,null,null,null,null,null,null,null,null,null,null,null,null,null,null,null,null,null,null,null,null,null,null,null,null,null,null,null,null,null,null,null,null,null,null,null,null,null,null,null,"",""]
[null,null,null,null,null,null,null,null,null,null,null,null,null,null,null,null,null,null,null,null,null,null,null,null,null,null,null,null,null,null,null,null,null,null,null,null,null,null,null,null,"",""]
[null,null,null,null,null,null,null,null,null,null,null,null,null,null,null,null,null,null,null,null,null,null,null,null,null,null,null,null,null,null,null,null,null,null,null,null,null,null,null,null,"",""]
[null,null,null,null,null,null,null,null,null,null,null,null,null,null,null,null,null,null,null,null,null,null,null,null,null,null,null,null,null,null,null,null,null,null,null,null,null,null,null,null,"",""]
[null,null,null,null,null,null,null,null,null,null,null,null,null,null,null,null,null,null,null,null,null,null,null,null,null,null,null,null,null,null,null,null,null,null,null,null,null,null,null,null,"",""]
[null,null,null,null,null,null,null,null,null,null,null,null,null,null,null,null,null,null,null,null,null,null,null,null,null,null,null,null,null,null,null,null,null,null,null,null,null,null,null,null,"",""]
[null,null,null,null,null,null,null,null,null,null,null,null,null,null,null,null,null,null,null,null,null,null,null,null,null,null,null,null,null,null,null,null,null,null,null,null,null,null,null,null,"",""]
[null,null,null,null,null,null,null,null,null,null,null,null,null,null,null,null,null,null,null,null,null,null,null,null,null,null,null,null,null,null,null,null,null,null,null,null,null,null,null,null,"",""]
[null,null,null,null,null,null,null,null,null,null,null,null,null,null,null,null,null,null,null,null,null,null,null,null,null,null,null,null,null,null,null,null,null,null,null,null,null,null,null,null,"",""]
[null,null,null,null,null,null,null,null,null,null,null,null,null,null,null,null,null,null,null,null,null,null,null,null,null,null,null,null,null,null,null,null,null,null,null,null,null,null,null,null,"",""]
[null,null,null,null,null,null,null,null,null,null,null,null,null,null,null,null,null,null,null,null,null,null,null,null,null,null,null,null,null,null,null,null,null,null,null,null,null,null,null,null,"",""]
[null,null,null,null,null,null,null,null,null,null,null,null,null,null,null,null,null,null,null,null,null,null,null,null,null,null,null,null,null,null,null,null,null,null,null,null,null,null,null,null,"",""]
[null,null,null,null,null,null,null,null,null,null,null,null,null,null,null,null,null,null,null,null,null,null,null,null,null,null,null,null,null,null,null,null,null,null,null,null,null,null,null,null,"",""]
[null,null,null,null,null,null,null,null,null,null,null,null,null,null,null,null,null,null,null,null,null,null,null,null,null,null,null,null,null,null,null,null,null,null,null,null,null,null,null,null,"",""]
[null,null,null,null,null,null,null,null,null,null,null,null,null,null,null,null,null,null,null,null,null,null,null,null,null,null,null,null,null,null,null,null,null,null,null,null,null,null,null,null,"",""]
[null,null,null,null,null,null,null,null,null,null,null,null,null,null,null,null,null,null,null,null,null,null,null,null,null,null,null,null,null,null,null,null,null,null,null,null,null,null,null,null,"",""]
[null,null,null,null,null,null,null,null,null,null,null,null,null,null,null,null,null,null,null,null,null,null,null,null,null,null,null,null,null,null,null,null,null,null,null,null,null,null,null,null,"",""]
[null,null,null,null,null,null,null,null,null,null,null,null,null,null,null,null,null,null,null,null,null,null,null,null,null,null,null,null,null,null,null,null,null,null,null,null,null,null,null,null,"",""]
[null,null,null,null,null,null,null,null,null,null,null,null,null,null,null,null,null,null,null,null,null,null,null,null,null,null,null,null,null,null,null,null,null,null,null,null,null,null,null,null,"",""]
[null,null,null,null,null,null,null,null,null,null,null,null,null,null,null,null,null,null,null,null,null,null,null,null,null,null,null,null,null,null,null,null,null,null,null,null,null,null,null,null,"",""]
[null,null,null,null,null,null,null,null,null,null,null,null,null,null,null,null,null,null,null,null,null,null,null,null,null,null,null,null,null,null,null,null,null,null,null,null,null,null,null,null,"",""]
[null,null,null,null,null,null,null,null,null,null,null,null,null,null,null,null,null,null,null,null,null,null,null,null,null,null,null,null,null,null,null,null,null,null,null,null,null,null,null,null,"",""]
[null,null,null,null,null,null,null,null,null,null,null,null,null,null,null,null,null,null,null,null,null,null,null,null,null,null,null,null,null,null,null,null,null,null,null,null,null,null,null,null,"",""]
[null,null,null,null,null,null,null,null,null,null,null,null,null,null,null,null,null,null,null,null,null,null,null,null,null,null,null,null,null,null,null,null,null,null,null,null,null,null,null,null,"",""]
[null,null,null,null,null,null,null,null,null,null,null,null,null,null,null,null,null,null,null,null,null,null,null,null,null,null,null,null,null,null,null,null,null,null,null,null,null,null,null,null,"",""]
[null,null,null,null,null,null,null,null,null,null,null,null,null,null,null,null,null,null,null,null,null,null,null,null,null,null,null,null,null,null,null,null,null,null,null,null,null,null,null,null,"",""]
[null,null,null,null,null,null,null,null,null,null,null,null,null,null,null,null,null,null,null,null,null,null,null,null,null,null,null,null,null,null,null,null,null,null,null,null,null,null,null,null,"",""]
[null,null,null,null,null,null,null,null,null,null,null,null,null,null,null,null,null,null,null,null,null,null,null,null,null,null,null,null,null,null,null,null,null,null,null,null,null,null,null,null,{"$f":"IF(AN709=\"\",\"\",IFERROR(MATCH(AN709,$AD$4:$AD$1000,0),_xlfn.XLOOKUP(AN709,$Y$4:$Y$1000,$AA$4:$AA$1000,\"\",0)))","v":""},""]
[null,null,null,null,null,null,null,null,null,null,null,null,null,null,null,null,null,null,null,null,null,null,null,null,null,null,null,null,null,null,null,null,null,null,null,null,null,null,null,null,"",""]
[null,null,null,null,null,null,null,null,null,null,null,null,null,null,null,null,null,null,null,null,null,null,null,null,null,null,null,null,null,null,null,null,null,null,null,null,null,null,null,null,"",""]
[null,null,null,null,null,null,null,null,null,null,null,null,null,null,null,null,null,null,null,null,null,null,null,null,null,null,null,null,null,null,null,null,null,null,null,null,null,null,null,null,"",""]
[null,null,null,null,null,null,null,null,null,null,null,null,null,null,null,null,null,null,null,null,null,null,null,null,null,null,null,null,null,null,null,null,null,null,null,null,null,null,null,null,"",""]
[null,null,null,null,null,null,null,null,null,null,null,null,null,null,null,null,null,null,null,null,null,null,null,null,null,null,null,null,null,null,null,null,null,null,null,null,null,null,null,null,"",""]
[null,null,null,null,null,null,null,null,null,null,null,null,null,null,null,null,null,null,null,null,null,null,null,null,null,null,null,null,null,null,null,null,null,null,null,null,null,null,null,null,"",""]
[null,null,null,null,null,null,null,null,null,null,null,null,null,null,null,null,null,null,null,null,null,null,null,null,null,null,null,null,null,null,null,null,null,null,null,null,null,null,null,null,"",""]
[null,null,null,null,null,null,null,null,null,null,null,null,null,null,null,null,null,null,null,null,null,null,null,null,null,null,null,null,null,null,null,null,null,null,null,null,null,null,null,null,"",""]
[null,null,null,null,null,null,null,null,null,null,null,null,null,null,null,null,null,null,null,null,null,null,null,null,null,null,null,null,null,null,null,null,null,null,null,null,null,null,null,null,"",""]
[null,null,null,null,null,null,null,null,null,null,null,null,null,null,null,null,null,null,null,null,null,null,null,null,null,null,null,null,null,null,null,null,null,null,null,null,null,null,null,null,"",""]
[null,null,null,null,null,null,null,null,null,null,null,null,null,null,null,null,null,null,null,null,null,null,null,null,null,null,null,null,null,null,null,null,null,null,null,null,null,null,null,null,"",""]
[null,null,null,null,null,null,null,null,null,null,null,null,null,null,null,null,null,null,null,null,null,null,null,null,null,null,null,null,null,null,null,null,null,null,null,null,null,null,null,null,"",""]
[null,null,null,null,null,null,null,null,null,null,null,null,null,null,null,null,null,null,null,null,null,null,null,null,null,null,null,null,null,null,null,null,null,null,null,null,null,null,null,null,"",""]
[null,null,null,null,null,null,null,null,null,null,null,null,null,null,null,null,null,null,null,null,null,null,null,null,null,null,null,null,null,null,null,null,null,null,null,null,null,null,null,null,"",""]
[null,null,null,null,null,null,null,null,null,null,null,null,null,null,null,null,null,null,null,null,null,null,null,null,null,null,null,null,null,null,null,null,null,null,null,null,null,null,null,null,"",""]
[null,null,null,null,null,null,null,null,null,null,null,null,null,null,null,null,null,null,null,null,null,null,null,null,null,null,null,null,null,null,null,null,null,null,null,null,null,null,null,null,"",""]
[null,null,null,null,null,null,null,null,null,null,null,null,null,null,null,null,null,null,null,null,null,null,null,null,null,null,null,null,null,null,null,null,null,null,null,null,null,null,null,null,"",{"$f":"IF(AN726=\"\",\"\",IF(N(AO726)=0,AO726,AM726))","v":""}]
[null,null,null,null,null,null,null,null,null,null,null,null,null,null,null,null,null,null,null,null,null,null,null,null,null,null,null,null,null,null,null,null,null,null,null,null,null,null,null,null,"",""]
[null,null,null,null,null,null,null,null,null,null,null,null,null,null,null,null,null,null,null,null,null,null,null,null,null,null,null,null,null,null,null,null,null,null,null,null,null,null,null,null,"",""]
[null,null,null,null,null,null,null,null,null,null,null,null,null,null,null,null,null,null,null,null,null,null,null,null,null,null,null,null,null,null,null,null,null,null,null,null,null,null,null,null,"",""]
[null,null,null,null,null,null,null,null,null,null,null,null,null,null,null,null,null,null,null,null,null,null,null,null,null,null,null,null,null,null,null,null,null,null,null,null,null,null,null,null,"",""]
[null,null,null,null,null,null,null,null,null,null,null,null,null,null,null,null,null,null,null,null,null,null,null,null,null,null,null,null,null,null,null,null,null,null,null,null,null,null,null,null,"",""]
[null,null,null,null,null,null,null,null,null,null,null,null,null,null,null,null,null,null,null,null,null,null,null,null,null,null,null,null,null,null,null,null,null,null,null,null,null,null,null,null,"",""]
[null,null,null,null,null,null,null,null,null,null,null,null,null,null,null,null,null,null,null,null,null,null,null,null,null,null,null,null,null,null,null,null,null,null,null,null,null,null,null,null,"",""]
[null,null,null,null,null,null,null,null,null,null,null,null,null,null,null,null,null,null,null,null,null,null,null,null,null,null,null,null,null,null,null,null,null,null,null,null,null,null,null,null,"",""]
[null,null,null,null,null,null,null,null,null,null,null,null,null,null,null,null,null,null,null,null,null,null,null,null,null,null,null,null,null,null,null,null,null,null,null,null,null,null,null,null,"",""]
[null,null,null,null,null,null,null,null,null,null,null,null,null,null,null,null,null,null,null,null,null,null,null,null,null,null,null,null,null,null,null,null,null,null,null,null,null,null,null,null,"",""]
[null,null,null,null,null,null,null,null,null,null,null,null,null,null,null,null,null,null,null,null,null,null,null,null,null,null,null,null,null,null,null,null,null,null,null,null,null,null,null,null,"",""]
[null,null,null,null,null,null,null,null,null,null,null,null,null,null,null,null,null,null,null,null,null,null,null,null,null,null,null,null,null,null,null,null,null,null,null,null,null,null,null,null,"",""]
[null,null,null,null,null,null,null,null,null,null,null,null,null,null,null,null,null,null,null,null,null,null,null,null,null,null,null,null,null,null,null,null,null,null,null,null,null,null,null,null,"",""]
[null,null,null,null,null,null,null,null,null,null,null,null,null,null,null,null,null,null,null,null,null,null,null,null,null,null,null,null,null,null,null,null,null,null,null,null,null,null,null,null,"",""]
[null,null,null,null,null,null,null,null,null,null,null,null,null,null,null,null,null,null,null,null,null,null,null,null,null,null,null,null,null,null,null,null,null,null,null,null,null,null,null,null,"",""]
[null,null,null,null,null,null,null,null,null,null,null,null,null,null,null,null,null,null,null,null,null,null,null,null,null,null,null,null,null,null,null,null,null,null,null,null,null,null,null,null,"",""]
[null,null,null,null,null,null,null,null,null,null,null,null,null,null,null,null,null,null,null,null,null,null,null,null,null,null,null,null,null,null,null,null,null,null,null,null,null,null,null,null,"",""]
[null,null,null,null,null,null,null,null,null,null,null,null,null,null,null,null,null,null,null,null,null,null,null,null,null,null,null,null,null,null,null,null,null,null,null,null,null,null,null,null,"",""]
[null,null,null,null,null,null,null,null,null,null,null,null,null,null,null,null,null,null,null,null,null,null,null,null,null,null,null,null,null,null,null,null,null,null,null,null,null,null,null,null,"",""]
[null,null,null,null,null,null,null,null,null,null,null,null,null,null,null,null,null,null,null,null,null,null,null,null,null,null,null,null,null,null,null,null,null,null,null,null,null,null,null,null,"",""]
[null,null,null,null,null,null,null,null,null,null,null,null,null,null,null,null,null,null,null,null,null,null,null,null,null,null,null,null,null,null,null,null,null,null,null,null,null,null,null,null,"",""]
[null,null,null,null,null,null,null,null,null,null,null,null,null,null,null,null,null,null,null,null,null,null,null,null,null,null,null,null,null,null,null,null,null,null,null,null,null,null,null,null,"",""]
[null,null,null,null,null,null,null,null,null,null,null,null,null,null,null,null,null,null,null,null,null,null,null,null,null,null,null,null,null,null,null,null,null,null,null,null,null,null,null,null,"",""]
[null,null,null,null,null,null,null,null,null,null,null,null,null,null,null,null,null,null,null,null,null,null,null,null,null,null,null,null,null,null,null,null,null,null,null,null,null,null,null,null,"",""]
[null,null,null,null,null,null,null,null,null,null,null,null,null,null,null,null,null,null,null,null,null,null,null,null,null,null,null,null,null,null,null,null,null,null,null,null,null,null,null,null,"",""]
[null,null,null,null,null,null,null,null,null,null,null,null,null,null,null,null,null,null,null,null,null,null,null,null,null,null,null,null,null,null,null,null,null,null,null,null,null,null,null,null,"",""]
[null,null,null,null,null,null,null,null,null,null,null,null,null,null,null,null,null,null,null,null,null,null,null,null,null,null,null,null,null,null,null,null,null,null,null,null,null,null,null,null,"",""]
[null,null,null,null,null,null,null,null,null,null,null,null,null,null,null,null,null,null,null,null,null,null,null,null,null,null,null,null,null,null,null,null,null,null,null,null,null,null,null,null,"",""]
[null,null,null,null,null,null,null,null,null,null,null,null,null,null,null,null,null,null,null,null,null,null,null,null,null,null,null,null,null,null,null,null,null,null,null,null,null,null,null,null,"",""]
[null,null,null,null,null,null,null,null,null,null,null,null,null,null,null,null,null,null,null,null,null,null,null,null,null,null,null,null,null,null,null,null,null,null,null,null,null,null,null,null,"",""]
[null,null,null,null,null,null,null,null,null,null,null,null,null,null,null,null,null,null,null,null,null,null,null,null,null,null,null,null,null,null,null,null,null,null,null,null,null,null,null,null,"",""]
[null,null,null,null,null,null,null,null,null,null,null,null,null,null,null,null,null,null,null,null,null,null,null,null,null,null,null,null,null,null,null,null,null,null,null,null,null,null,null,null,"",""]
[null,null,null,null,null,null,null,null,null,null,null,null,null,null,null,null,null,null,null,null,null,null,null,null,null,null,null,null,null,null,null,null,null,null,null,null,null,null,null,null,"",""]
[null,null,null,null,null,null,null,null,null,null,null,null,null,null,null,null,null,null,null,null,null,null,null,null,null,null,null,null,null,null,null,null,null,null,null,null,null,null,null,null,"",""]
[null,null,null,null,null,null,null,null,null,null,null,null,null,null,null,null,null,null,null,null,null,null,null,null,null,null,null,null,null,null,null,null,null,null,null,null,null,null,null,null,"",""]
[null,null,null,null,null,null,null,null,null,null,null,null,null,null,null,null,null,null,null,null,null,null,null,null,null,null,null,null,null,null,null,null,null,null,null,null,null,null,null,null,"",""]
[null,null,null,null,null,null,null,null,null,null,null,null,null,null,null,null,null,null,null,null,null,null,null,null,null,null,null,null,null,null,null,null,null,null,null,null,null,null,null,null,"",""]
[null,null,null,null,null,null,null,null,null,null,null,null,null,null,null,null,null,null,null,null,null,null,null,null,null,null,null,null,null,null,null,null,null,null,null,null,null,null,null,null,"",""]
[null,null,null,null,null,null,null,null,null,null,null,null,null,null,null,null,null,null,null,null,null,null,null,null,null,null,null,null,null,null,null,null,null,null,null,null,null,null,null,null,"",""]
[null,null,null,null,null,null,null,null,null,null,null,null,null,null,null,null,null,null,null,null,null,null,null,null,null,null,null,null,null,null,null,null,null,null,null,null,null,null,null,null,"",""]
[null,null,null,null,null,null,null,null,null,null,null,null,null,null,null,null,null,null,null,null,null,null,null,null,null,null,null,null,null,null,null,null,null,null,null,null,null,null,null,null,"",""]
[null,null,null,null,null,null,null,null,null,null,null,null,null,null,null,null,null,null,null,null,null,null,null,null,null,null,null,null,null,null,null,null,null,null,null,null,null,null,null,null,"",""]
[null,null,null,null,null,null,null,null,null,null,null,null,null,null,null,null,null,null,null,null,null,null,null,null,null,null,null,null,null,null,null,null,null,null,null,null,null,null,null,null,"",""]
[null,null,null,null,null,null,null,null,null,null,null,null,null,null,null,null,null,null,null,null,null,null,null,null,null,null,null,null,null,null,null,null,null,null,null,null,null,null,null,null,"",""]
[null,null,null,null,null,null,null,null,null,null,null,null,null,null,null,null,null,null,null,null,null,null,null,null,null,null,null,null,null,null,null,null,null,null,null,null,null,null,null,null,"",""]
[null,null,null,null,null,null,null,null,null,null,null,null,null,null,null,null,null,null,null,null,null,null,null,null,null,null,null,null,null,null,null,null,null,null,null,null,null,null,null,null,"",""]
[null,null,null,null,null,null,null,null,null,null,null,null,null,null,null,null,null,null,null,null,null,null,null,null,null,null,null,null,null,null,null,null,null,null,null,null,null,null,null,null,{"$f":"IF(AN773=\"\",\"\",IFERROR(MATCH(AN773,$AD$4:$AD$1000,0),_xlfn.XLOOKUP(AN773,$Y$4:$Y$1000,$AA$4:$AA$1000,\"\",0)))","v":""},""]
[null,null,null,null,null,null,null,null,null,null,null,null,null,null,null,null,null,null,null,null,null,null,null,null,null,null,null,null,null,null,null,null,null,null,null,null,null,null,null,null,"",""]
[null,null,null,null,null,null,null,null,null,null,null,null,null,null,null,null,null,null,null,null,null,null,null,null,null,null,null,null,null,null,null,null,null,null,null,null,null,null,null,null,"",""]
[null,null,null,null,null,null,null,null,null,null,null,null,null,null,null,null,null,null,null,null,null,null,null,null,null,null,null,null,null,null,null,null,null,null,null,null,null,null,null,null,"",""]
[null,null,null,null,null,null,null,null,null,null,null,null,null,null,null,null,null,null,null,null,null,null,null,null,null,null,null,null,null,null,null,null,null,null,null,null,null,null,null,null,"",""]
[null,null,null,null,null,null,null,null,null,null,null,null,null,null,null,null,null,null,null,null,null,null,null,null,null,null,null,null,null,null,null,null,null,null,null,null,null,null,null,null,"",""]
[null,null,null,null,null,null,null,null,null,null,null,null,null,null,null,null,null,null,null,null,null,null,null,null,null,null,null,null,null,null,null,null,null,null,null,null,null,null,null,null,"",""]
[null,null,null,null,null,null,null,null,null,null,null,null,null,null,null,null,null,null,null,null,null,null,null,null,null,null,null,null,null,null,null,null,null,null,null,null,null,null,null,null,"",""]
[null,null,null,null,null,null,null,null,null,null,null,null,null,null,null,null,null,null,null,null,null,null,null,null,null,null,null,null,null,null,null,null,null,null,null,null,null,null,null,null,"",""]
[null,null,null,null,null,null,null,null,null,null,null,null,null,null,null,null,null,null,null,null,null,null,null,null,null,null,null,null,null,null,null,null,null,null,null,null,null,null,null,null,"",""]
[null,null,null,null,null,null,null,null,null,null,null,null,null,null,null,null,null,null,null,null,null,null,null,null,null,null,null,null,null,null,null,null,null,null,null,null,null,null,null,null,"",""]
[null,null,null,null,null,null,null,null,null,null,null,null,null,null,null,null,null,null,null,null,null,null,null,null,null,null,null,null,null,null,null,null,null,null,null,null,null,null,null,null,"",""]
[null,null,null,null,null,null,null,null,null,null,null,null,null,null,null,null,null,null,null,null,null,null,null,null,null,null,null,null,null,null,null,null,null,null,null,null,null,null,null,null,"",""]
[null,null,null,null,null,null,null,null,null,null,null,null,null,null,null,null,null,null,null,null,null,null,null,null,null,null,null,null,null,null,null,null,null,null,null,null,null,null,null,null,"",""]
[null,null,null,null,null,null,null,null,null,null,null,null,null,null,null,null,null,null,null,null,null,null,null,null,null,null,null,null,null,null,null,null,null,null,null,null,null,null,null,null,"",""]
[null,null,null,null,null,null,null,null,null,null,null,null,null,null,null,null,null,null,null,null,null,null,null,null,null,null,null,null,null,null,null,null,null,null,null,null,null,null,null,null,"",""]
[null,null,null,null,null,null,null,null,null,null,null,null,null,null,null,null,null,null,null,null,null,null,null,null,null,null,null,null,null,null,null,null,null,null,null,null,null,null,null,null,"",""]
[null,null,null,null,null,null,null,null,null,null,null,null,null,null,null,null,null,null,null,null,null,null,null,null,null,null,null,null,null,null,null,null,null,null,null,null,null,null,null,null,"",{"$f":"IF(AN790=\"\",\"\",IF(N(AO790)=0,AO790,AM790))","v":""}]
[null,null,null,null,null,null,null,null,null,null,null,null,null,null,null,null,null,null,null,null,null,null,null,null,null,null,null,null,null,null,null,null,null,null,null,null,null,null,null,null,"",""]
[null,null,null,null,null,null,null,null,null,null,null,null,null,null,null,null,null,null,null,null,null,null,null,null,null,null,null,null,null,null,null,null,null,null,null,null,null,null,null,null,"",""]
[null,null,null,null,null,null,null,null,null,null,null,null,null,null,null,null,null,null,null,null,null,null,null,null,null,null,null,null,null,null,null,null,null,null,null,null,null,null,null,null,"",""]
[null,null,null,null,null,null,null,null,null,null,null,null,null,null,null,null,null,null,null,null,null,null,null,null,null,null,null,null,null,null,null,null,null,null,null,null,null,null,null,null,"",""]
[null,null,null,null,null,null,null,null,null,null,null,null,null,null,null,null,null,null,null,null,null,null,null,null,null,null,null,null,null,null,null,null,null,null,null,null,null,null,null,null,"",""]
[null,null,null,null,null,null,null,null,null,null,null,null,null,null,null,null,null,null,null,null,null,null,null,null,null,null,null,null,null,null,null,null,null,null,null,null,null,null,null,null,"",""]
[null,null,null,null,null,null,null,null,null,null,null,null,null,null,null,null,null,null,null,null,null,null,null,null,null,null,null,null,null,null,null,null,null,null,null,null,null,null,null,null,"",""]
[null,null,null,null,null,null,null,null,null,null,null,null,null,null,null,null,null,null,null,null,null,null,null,null,null,null,null,null,null,null,null,null,null,null,null,null,null,null,null,null,"",""]
[null,null,null,null,null,null,null,null,null,null,null,null,null,null,null,null,null,null,null,null,null,null,null,null,null,null,null,null,null,null,null,null,null,null,null,null,null,null,null,null,"",""]
[null,null,null,null,null,null,null,null,null,null,null,null,null,null,null,null,null,null,null,null,null,null,null,null,null,null,null,null,null,null,null,null,null,null,null,null,null,null,null,null,"",""]
[null,null,null,null,null,null,null,null,null,null,null,null,null,null,null,null,null,null,null,null,null,null,null,null,null,null,null,null,null,null,null,null,null,null,null,null,null,null,null,null,"",""]
[null,null,null,null,null,null,null,null,null,null,null,null,null,null,null,null,null,null,null,null,null,null,null,null,null,null,null,null,null,null,null,null,null,null,null,null,null,null,null,null,"",""]
[null,null,null,null,null,null,null,null,null,null,null,null,null,null,null,null,null,null,null,null,null,null,null,null,null,null,null,null,null,null,null,null,null,null,null,null,null,null,null,null,"",""]
[null,null,null,null,null,null,null,null,null,null,null,null,null,null,null,null,null,null,null,null,null,null,null,null,null,null,null,null,null,null,null,null,null,null,null,null,null,null,null,null,"",""]
[null,null,null,null,null,null,null,null,null,null,null,null,null,null,null,null,null,null,null,null,null,null,null,null,null,null,null,null,null,null,null,null,null,null,null,null,null,null,null,null,"",""]
[null,null,null,null,null,null,null,null,null,null,null,null,null,null,null,null,null,null,null,null,null,null,null,null,null,null,null,null,null,null,null,null,null,null,null,null,null,null,null,null,"",""]
[null,null,null,null,null,null,null,null,null,null,null,null,null,null,null,null,null,null,null,null,null,null,null,null,null,null,null,null,null,null,null,null,null,null,null,null,null,null,null,null,"",""]
[null,null,null,null,null,null,null,null,null,null,null,null,null,null,null,null,null,null,null,null,null,null,null,null,null,null,null,null,null,null,null,null,null,null,null,null,null,null,null,null,"",""]
[null,null,null,null,null,null,null,null,null,null,null,null,null,null,null,null,null,null,null,null,null,null,null,null,null,null,null,null,null,null,null,null,null,null,null,null,null,null,null,null,"",""]
[null,null,null,null,null,null,null,null,null,null,null,null,null,null,null,null,null,null,null,null,null,null,null,null,null,null,null,null,null,null,null,null,null,null,null,null,null,null,null,null,"",""]
[null,null,null,null,null,null,null,null,null,null,null,null,null,null,null,null,null,null,null,null,null,null,null,null,null,null,null,null,null,null,null,null,null,null,null,null,null,null,null,null,"",""]
[null,null,null,null,null,null,null,null,null,null,null,null,null,null,null,null,null,null,null,null,null,null,null,null,null,null,null,null,null,null,null,null,null,null,null,null,null,null,null,null,"",""]
[null,null,null,null,null,null,null,null,null,null,null,null,null,null,null,null,null,null,null,null,null,null,null,null,null,null,null,null,null,null,null,null,null,null,null,null,null,null,null,null,"",""]
[null,null,null,null,null,null,null,null,null,null,null,null,null,null,null,null,null,null,null,null,null,null,null,null,null,null,null,null,null,null,null,null,null,null,null,null,null,null,null,null,"",""]
[null,null,null,null,null,null,null,null,null,null,null,null,null,null,null,null,null,null,null,null,null,null,null,null,null,null,null,null,null,null,null,null,null,null,null,null,null,null,null,null,"",""]
[null,null,null,null,null,null,null,null,null,null,null,null,null,null,null,null,null,null,null,null,null,null,null,null,null,null,null,null,null,null,null,null,null,null,null,null,null,null,null,null,"",""]
[null,null,null,null,null,null,null,null,null,null,null,null,null,null,null,null,null,null,null,null,null,null,null,null,null,null,null,null,null,null,null,null,null,null,null,null,null,null,null,null,"",""]
[null,null,null,null,null,null,null,null,null,null,null,null,null,null,null,null,null,null,null,null,null,null,null,null,null,null,null,null,null,null,null,null,null,null,null,null,null,null,null,null,"",""]
[null,null,null,null,null,null,null,null,null,null,null,null,null,null,null,null,null,null,null,null,null,null,null,null,null,null,null,null,null,null,null,null,null,null,null,null,null,null,null,null,"",""]
[null,null,null,null,null,null,null,null,null,null,null,null,null,null,null,null,null,null,null,null,null,null,null,null,null,null,null,null,null,null,null,null,null,null,null,null,null,null,null,null,"",""]
[null,null,null,null,null,null,null,null,null,null,null,null,null,null,null,null,null,null,null,null,null,null,null,null,null,null,null,null,null,null,null,null,null,null,null,null,null,null,null,null,"",""]
[null,null,null,null,null,null,null,null,null,null,null,null,null,null,null,null,null,null,null,null,null,null,null,null,null,null,null,null,null,null,null,null,null,null,null,null,null,null,null,null,"",""]
[null,null,null,null,null,null,null,null,null,null,null,null,null,null,null,null,null,null,null,null,null,null,null,null,null,null,null,null,null,null,null,null,null,null,null,null,null,null,null,null,"",""]
[null,null,null,null,null,null,null,null,null,null,null,null,null,null,null,null,null,null,null,null,null,null,null,null,null,null,null,null,null,null,null,null,null,null,null,null,null,null,null,null,"",""]
[null,null,null,null,null,null,null,null,null,null,null,null,null,null,null,null,null,null,null,null,null,null,null,null,null,null,null,null,null,null,null,null,null,null,null,null,null,null,null,null,"",""]
[null,null,null,null,null,null,null,null,null,null,null,null,null,null,null,null,null,null,null,null,null,null,null,null,null,null,null,null,null,null,null,null,null,null,null,null,null,null,null,null,"",""]
[null,null,null,null,null,null,null,null,null,null,null,null,null,null,null,null,null,null,null,null,null,null,null,null,null,null,null,null,null,null,null,null,null,null,null,null,null,null,null,null,"",""]
[null,null,null,null,null,null,null,null,null,null,null,null,null,null,null,null,null,null,null,null,null,null,null,null,null,null,null,null,null,null,null,null,null,null,null,null,null,null,null,null,"",""]
[null,null,null,null,null,null,null,null,null,null,null,null,null,null,null,null,null,null,null,null,null,null,null,null,null,null,null,null,null,null,null,null,null,null,null,null,null,null,null,null,"",""]
[null,null,null,null,null,null,null,null,null,null,null,null,null,null,null,null,null,null,null,null,null,null,null,null,null,null,null,null,null,null,null,null,null,null,null,null,null,null,null,null,"",""]
[null,null,null,null,null,null,null,null,null,null,null,null,null,null,null,null,null,null,null,null,null,null,null,null,null,null,null,null,null,null,null,null,null,null,null,null,null,null,null,null,"",""]
[null,null,null,null,null,null,null,null,null,null,null,null,null,null,null,null,null,null,null,null,null,null,null,null,null,null,null,null,null,null,null,null,null,null,null,null,null,null,null,null,"",""]
[null,null,null,null,null,null,null,null,null,null,null,null,null,null,null,null,null,null,null,null,null,null,null,null,null,null,null,null,null,null,null,null,null,null,null,null,null,null,null,null,"",""]
[null,null,null,null,null,null,null,null,null,null,null,null,null,null,null,null,null,null,null,null,null,null,null,null,null,null,null,null,null,null,null,null,null,null,null,null,null,null,null,null,"",""]
[null,null,null,null,null,null,null,null,null,null,null,null,null,null,null,null,null,null,null,null,null,null,null,null,null,null,null,null,null,null,null,null,null,null,null,null,null,null,null,null,"",""]
[null,null,null,null,null,null,null,null,null,null,null,null,null,null,null,null,null,null,null,null,null,null,null,null,null,null,null,null,null,null,null,null,null,null,null,null,null,null,null,null,"",""]
[null,null,null,null,null,null,null,null,null,null,null,null,null,null,null,null,null,null,null,null,null,null,null,null,null,null,null,null,null,null,null,null,null,null,null,null,null,null,null,null,{"$f":"IF(AN837=\"\",\"\",IFERROR(MATCH(AN837,$AD$4:$AD$1000,0),_xlfn.XLOOKUP(AN837,$Y$4:$Y$1000,$AA$4:$AA$1000,\"\",0)))","v":""},""]
[null,null,null,null,null,null,null,null,null,null,null,null,null,null,null,null,null,null,null,null,null,null,null,null,null,null,null,null,null,null,null,null,null,null,null,null,null,null,null,null,"",""]
[null,null,null,null,null,null,null,null,null,null,null,null,null,null,null,null,null,null,null,null,null,null,null,null,null,null,null,null,null,null,null,null,null,null,null,null,null,null,null,null,"",""]
[null,null,null,null,null,null,null,null,null,null,null,null,null,null,null,null,null,null,null,null,null,null,null,null,null,null,null,null,null,null,null,null,null,null,null,null,null,null,null,null,"",""]
[null,null,null,null,null,null,null,null,null,null,null,null,null,null,null,null,null,null,null,null,null,null,null,null,null,null,null,null,null,null,null,null,null,null,null,null,null,null,null,null,"",""]
[null,null,null,null,null,null,null,null,null,null,null,null,null,null,null,null,null,null,null,null,null,null,null,null,null,null,null,null,null,null,null,null,null,null,null,null,null,null,null,null,"",""]
[null,null,null,null,null,null,null,null,null,null,null,null,null,null,null,null,null,null,null,null,null,null,null,null,null,null,null,null,null,null,null,null,null,null,null,null,null,null,null,null,"",""]
[null,null,null,null,null,null,null,null,null,null,null,null,null,null,null,null,null,null,null,null,null,null,null,null,null,null,null,null,null,null,null,null,null,null,null,null,null,null,null,null,"",""]
[null,null,null,null,null,null,null,null,null,null,null,null,null,null,null,null,null,null,null,null,null,null,null,null,null,null,null,null,null,null,null,null,null,null,null,null,null,null,null,null,"",""]
[null,null,null,null,null,null,null,null,null,null,null,null,null,null,null,null,null,null,null,null,null,null,null,null,null,null,null,null,null,null,null,null,null,null,null,null,null,null,null,null,"",""]
[null,null,null,null,null,null,null,null,null,null,null,null,null,null,null,null,null,null,null,null,null,null,null,null,null,null,null,null,null,null,null,null,null,null,null,null,null,null,null,null,"",""]
[null,null,null,null,null,null,null,null,null,null,null,null,null,null,null,null,null,null,null,null,null,null,null,null,null,null,null,null,null,null,null,null,null,null,null,null,null,null,null,null,"",""]
[null,null,null,null,null,null,null,null,null,null,null,null,null,null,null,null,null,null,null,null,null,null,null,null,null,null,null,null,null,null,null,null,null,null,null,null,null,null,null,null,"",""]
[null,null,null,null,null,null,null,null,null,null,null,null,null,null,null,null,null,null,null,null,null,null,null,null,null,null,null,null,null,null,null,null,null,null,null,null,null,null,null,null,"",""]
[null,null,null,null,null,null,null,null,null,null,null,null,null,null,null,null,null,null,null,null,null,null,null,null,null,null,null,null,null,null,null,null,null,null,null,null,null,null,null,null,"",""]
[null,null,null,null,null,null,null,null,null,null,null,null,null,null,null,null,null,null,null,null,null,null,null,null,null,null,null,null,null,null,null,null,null,null,null,null,null,null,null,null,"",""]
[null,null,null,null,null,null,null,null,null,null,null,null,null,null,null,null,null,null,null,null,null,null,null,null,null,null,null,null,null,null,null,null,null,null,null,null,null,null,null,null,"",""]
[null,null,null,null,null,null,null,null,null,null,null,null,null,null,null,null,null,null,null,null,null,null,null,null,null,null,null,null,null,null,null,null,null,null,null,null,null,null,null,null,"",{"$f":"IF(AN854=\"\",\"\",IF(N(AO854)=0,AO854,AM854))","v":""}]
[null,null,null,null,null,null,null,null,null,null,null,null,null,null,null,null,null,null,null,null,null,null,null,null,null,null,null,null,null,null,null,null,null,null,null,null,null,null,null,null,"",""]
[null,null,null,null,null,null,null,null,null,null,null,null,null,null,null,null,null,null,null,null,null,null,null,null,null,null,null,null,null,null,null,null,null,null,null,null,null,null,null,null,"",""]
[null,null,null,null,null,null,null,null,null,null,null,null,null,null,null,null,null,null,null,null,null,null,null,null,null,null,null,null,null,null,null,null,null,null,null,null,null,null,null,null,"",""]
[null,null,null,null,null,null,null,null,null,null,null,null,null,null,null,null,null,null,null,null,null,null,null,null,null,null,null,null,null,null,null,null,null,null,null,null,null,null,null,null,"",""]
[null,null,null,null,null,null,null,null,null,null,null,null,null,null,null,null,null,null,null,null,null,null,null,null,null,null,null,null,null,null,null,null,null,null,null,null,null,null,null,null,"",""]
[null,null,null,null,null,null,null,null,null,null,null,null,null,null,null,null,null,null,null,null,null,null,null,null,null,null,null,null,null,null,null,null,null,null,null,null,null,null,null,null,"",""]
[null,null,null,null,null,null,null,null,null,null,null,null,null,null,null,null,null,null,null,null,null,null,null,null,null,null,null,null,null,null,null,null,null,null,null,null,null,null,null,null,"",""]
[null,null,null,null,null,null,null,null,null,null,null,null,null,null,null,null,null,null,null,null,null,null,null,null,null,null,null,null,null,null,null,null,null,null,null,null,null,null,null,null,"",""]
[null,null,null,null,null,null,null,null,null,null,null,null,null,null,null,null,null,null,null,null,null,null,null,null,null,null,null,null,null,null,null,null,null,null,null,null,null,null,null,null,"",""]
[null,null,null,null,null,null,null,null,null,null,null,null,null,null,null,null,null,null,null,null,null,null,null,null,null,null,null,null,null,null,null,null,null,null,null,null,null,null,null,null,"",""]
[null,null,null,null,null,null,null,null,null,null,null,null,null,null,null,null,null,null,null,null,null,null,null,null,null,null,null,null,null,null,null,null,null,null,null,null,null,null,null,null,"",""]
[null,null,null,null,null,null,null,null,null,null,null,null,null,null,null,null,null,null,null,null,null,null,null,null,null,null,null,null,null,null,null,null,null,null,null,null,null,null,null,null,"",""]
[null,null,null,null,null,null,null,null,null,null,null,null,null,null,null,null,null,null,null,null,null,null,null,null,null,null,null,null,null,null,null,null,null,null,null,null,null,null,null,null,"",""]
[null,null,null,null,null,null,null,null,null,null,null,null,null,null,null,null,null,null,null,null,null,null,null,null,null,null,null,null,null,null,null,null,null,null,null,null,null,null,null,null,"",""]
[null,null,null,null,null,null,null,null,null,null,null,null,null,null,null,null,null,null,null,null,null,null,null,null,null,null,null,null,null,null,null,null,null,null,null,null,null,null,null,null,"",""]
[null,null,null,null,null,null,null,null,null,null,null,null,null,null,null,null,null,null,null,null,null,null,null,null,null,null,null,null,null,null,null,null,null,null,null,null,null,null,null,null,"",""]
[null,null,null,null,null,null,null,null,null,null,null,null,null,null,null,null,null,null,null,null,null,null,null,null,null,null,null,null,null,null,null,null,null,null,null,null,null,null,null,null,"",""]
[null,null,null,null,null,null,null,null,null,null,null,null,null,null,null,null,null,null,null,null,null,null,null,null,null,null,null,null,null,null,null,null,null,null,null,null,null,null,null,null,"",""]
[null,null,null,null,null,null,null,null,null,null,null,null,null,null,null,null,null,null,null,null,null,null,null,null,null,null,null,null,null,null,null,null,null,null,null,null,null,null,null,null,"",""]
[null,null,null,null,null,null,null,null,null,null,null,null,null,null,null,null,null,null,null,null,null,null,null,null,null,null,null,null,null,null,null,null,null,null,null,null,null,null,null,null,"",""]
[null,null,null,null,null,null,null,null,null,null,null,null,null,null,null,null,null,null,null,null,null,null,null,null,null,null,null,null,null,null,null,null,null,null,null,null,null,null,null,null,"",""]
[null,null,null,null,null,null,null,null,null,null,null,null,null,null,null,null,null,null,null,null,null,null,null,null,null,null,null,null,null,null,null,null,null,null,null,null,null,null,null,null,"",""]
[null,null,null,null,null,null,null,null,null,null,null,null,null,null,null,null,null,null,null,null,null,null,null,null,null,null,null,null,null,null,null,null,null,null,null,null,null,null,null,null,"",""]
[null,null,null,null,null,null,null,null,null,null,null,null,null,null,null,null,null,null,null,null,null,null,null,null,null,null,null,null,null,null,null,null,null,null,null,null,null,null,null,null,"",""]
[null,null,null,null,null,null,null,null,null,null,null,null,null,null,null,null,null,null,null,null,null,null,null,null,null,null,null,null,null,null,null,null,null,null,null,null,null,null,null,null,"",""]
[null,null,null,null,null,null,null,null,null,null,null,null,null,null,null,null,null,null,null,null,null,null,null,null,null,null,null,null,null,null,null,null,null,null,null,null,null,null,null,null,"",""]
[null,null,null,null,null,null,null,null,null,null,null,null,null,null,null,null,null,null,null,null,null,null,null,null,null,null,null,null,null,null,null,null,null,null,null,null,null,null,null,null,"",""]
[null,null,null,null,null,null,null,null,null,null,null,null,null,null,null,null,null,null,null,null,null,null,null,null,null,null,null,null,null,null,null,null,null,null,null,null,null,null,null,null,"",""]
[null,null,null,null,null,null,null,null,null,null,null,null,null,null,null,null,null,null,null,null,null,null,null,null,null,null,null,null,null,null,null,null,null,null,null,null,null,null,null,null,"",""]
[null,null,null,null,null,null,null,null,null,null,null,null,null,null,null,null,null,null,null,null,null,null,null,null,null,null,null,null,null,null,null,null,null,null,null,null,null,null,null,null,"",""]
[null,null,null,null,null,null,null,null,null,null,null,null,null,null,null,null,null,null,null,null,null,null,null,null,null,null,null,null,null,null,null,null,null,null,null,null,null,null,null,null,"",""]
[null,null,null,null,null,null,null,null,null,null,null,null,null,null,null,null,null,null,null,null,null,null,null,null,null,null,null,null,null,null,null,null,null,null,null,null,null,null,null,null,"",""]
[null,null,null,null,null,null,null,null,null,null,null,null,null,null,null,null,null,null,null,null,null,null,null,null,null,null,null,null,null,null,null,null,null,null,null,null,null,null,null,null,"",""]
[null,null,null,null,null,null,null,null,null,null,null,null,null,null,null,null,null,null,null,null,null,null,null,null,null,null,null,null,null,null,null,null,null,null,null,null,null,null,null,null,"",""]
[null,null,null,null,null,null,null,null,null,null,null,null,null,null,null,null,null,null,null,null,null,null,null,null,null,null,null,null,null,null,null,null,null,null,null,null,null,null,null,null,"",""]
[null,null,null,null,null,null,null,null,null,null,null,null,null,null,null,null,null,null,null,null,null,null,null,null,null,null,null,null,null,null,null,null,null,null,null,null,null,null,null,null,"",""]
[null,null,null,null,null,null,null,null,null,null,null,null,null,null,null,null,null,null,null,null,null,null,null,null,null,null,null,null,null,null,null,null,null,null,null,null,null,null,null,null,"",""]
[null,null,null,null,null,null,null,null,null,null,null,null,null,null,null,null,null,null,null,null,null,null,null,null,null,null,null,null,null,null,null,null,null,null,null,null,null,null,null,null,"",""]
[null,null,null,null,null,null,null,null,null,null,null,null,null,null,null,null,null,null,null,null,null,null,null,null,null,null,null,null,null,null,null,null,null,null,null,null,null,null,null,null,"",""]
[null,null,null,null,null,null,null,null,null,null,null,null,null,null,null,null,null,null,null,null,null,null,null,null,null,null,null,null,null,null,null,null,null,null,null,null,null,null,null,null,"",""]
[null,null,null,null,null,null,null,null,null,null,null,null,null,null,null,null,null,null,null,null,null,null,null,null,null,null,null,null,null,null,null,null,null,null,null,null,null,null,null,null,"",""]
[null,null,null,null,null,null,null,null,null,null,null,null,null,null,null,null,null,null,null,null,null,null,null,null,null,null,null,null,null,null,null,null,null,null,null,null,null,null,null,null,"",""]
[null,null,null,null,null,null,null,null,null,null,null,null,null,null,null,null,null,null,null,null,null,null,null,null,null,null,null,null,null,null,null,null,null,null,null,null,null,null,null,null,"",""]
[null,null,null,null,null,null,null,null,null,null,null,null,null,null,null,null,null,null,null,null,null,null,null,null,null,null,null,null,null,null,null,null,null,null,null,null,null,null,null,null,"",""]
[null,null,null,null,null,null,null,null,null,null,null,null,null,null,null,null,null,null,null,null,null,null,null,null,null,null,null,null,null,null,null,null,null,null,null,null,null,null,null,null,"",""]
[null,null,null,null,null,null,null,null,null,null,null,null,null,null,null,null,null,null,null,null,null,null,null,null,null,null,null,null,null,null,null,null,null,null,null,null,null,null,null,null,"",""]
[null,null,null,null,null,null,null,null,null,null,null,null,null,null,null,null,null,null,null,null,null,null,null,null,null,null,null,null,null,null,null,null,null,null,null,null,null,null,null,null,{"$f":"IF(AN901=\"\",\"\",IFERROR(MATCH(AN901,$AD$4:$AD$1000,0),_xlfn.XLOOKUP(AN901,$Y$4:$Y$1000,$AA$4:$AA$1000,\"\",0)))","v":""},""]
[null,null,null,null,null,null,null,null,null,null,null,null,null,null,null,null,null,null,null,null,null,null,null,null,null,null,null,null,null,null,null,null,null,null,null,null,null,null,null,null,"",""]
[null,null,null,null,null,null,null,null,null,null,null,null,null,null,null,null,null,null,null,null,null,null,null,null,null,null,null,null,null,null,null,null,null,null,null,null,null,null,null,null,"",""]
[null,null,null,null,null,null,null,null,null,null,null,null,null,null,null,null,null,null,null,null,null,null,null,null,null,null,null,null,null,null,null,null,null,null,null,null,null,null,null,null,"",""]
[null,null,null,null,null,null,null,null,null,null,null,null,null,null,null,null,null,null,null,null,null,null,null,null,null,null,null,null,null,null,null,null,null,null,null,null,null,null,null,null,"",""]
[null,null,null,null,null,null,null,null,null,null,null,null,null,null,null,null,null,null,null,null,null,null,null,null,null,null,null,null,null,null,null,null,null,null,null,null,null,null,null,null,"",""]
[null,null,null,null,null,null,null,null,null,null,null,null,null,null,null,null,null,null,null,null,null,null,null,null,null,null,null,null,null,null,null,null,null,null,null,null,null,null,null,null,"",""]
[null,null,null,null,null,null,null,null,null,null,null,null,null,null,null,null,null,null,null,null,null,null,null,null,null,null,null,null,null,null,null,null,null,null,null,null,null,null,null,null,"",""]
[null,null,null,null,null,null,null,null,null,null,null,null,null,null,null,null,null,null,null,null,null,null,null,null,null,null,null,null,null,null,null,null,null,null,null,null,null,null,null,null,"",""]
[null,null,null,null,null,null,null,null,null,null,null,null,null,null,null,null,null,null,null,null,null,null,null,null,null,null,null,null,null,null,null,null,null,null,null,null,null,null,null,null,"",""]
[null,null,null,null,null,null,null,null,null,null,null,null,null,null,null,null,null,null,null,null,null,null,null,null,null,null,null,null,null,null,null,null,null,null,null,null,null,null,null,null,"",""]
[null,null,null,null,null,null,null,null,null,null,null,null,null,null,null,null,null,null,null,null,null,null,null,null,null,null,null,null,null,null,null,null,null,null,null,null,null,null,null,null,"",""]
[null,null,null,null,null,null,null,null,null,null,null,null,null,null,null,null,null,null,null,null,null,null,null,null,null,null,null,null,null,null,null,null,null,null,null,null,null,null,null,null,"",""]
[null,null,null,null,null,null,null,null,null,null,null,null,null,null,null,null,null,null,null,null,null,null,null,null,null,null,null,null,null,null,null,null,null,null,null,null,null,null,null,null,"",""]
[null,null,null,null,null,null,null,null,null,null,null,null,null,null,null,null,null,null,null,null,null,null,null,null,null,null,null,null,null,null,null,null,null,null,null,null,null,null,null,null,"",""]
[null,null,null,null,null,null,null,null,null,null,null,null,null,null,null,null,null,null,null,null,null,null,null,null,null,null,null,null,null,null,null,null,null,null,null,null,null,null,null,null,"",""]
[null,null,null,null,null,null,null,null,null,null,null,null,null,null,null,null,null,null,null,null,null,null,null,null,null,null,null,null,null,null,null,null,null,null,null,null,null,null,null,null,"",""]
[null,null,null,null,null,null,null,null,null,null,null,null,null,null,null,null,null,null,null,null,null,null,null,null,null,null,null,null,null,null,null,null,null,null,null,null,null,null,null,null,"",{"$f":"IF(AN918=\"\",\"\",IF(N(AO918)=0,AO918,AM918))","v":""}]
[null,null,null,null,null,null,null,null,null,null,null,null,null,null,null,null,null,null,null,null,null,null,null,null,null,null,null,null,null,null,null,null,null,null,null,null,null,null,null,null,"",""]
[null,null,null,null,null,null,null,null,null,null,null,null,null,null,null,null,null,null,null,null,null,null,null,null,null,null,null,null,null,null,null,null,null,null,null,null,null,null,null,null,"",""]
[null,null,null,null,null,null,null,null,null,null,null,null,null,null,null,null,null,null,null,null,null,null,null,null,null,null,null,null,null,null,null,null,null,null,null,null,null,null,null,null,"",""]
[null,null,null,null,null,null,null,null,null,null,null,null,null,null,null,null,null,null,null,null,null,null,null,null,null,null,null,null,null,null,null,null,null,null,null,null,null,null,null,null,"",""]
[null,null,null,null,null,null,null,null,null,null,null,null,null,null,null,null,null,null,null,null,null,null,null,null,null,null,null,null,null,null,null,null,null,null,null,null,null,null,null,null,"",""]
[null,null,null,null,null,null,null,null,null,null,null,null,null,null,null,null,null,null,null,null,null,null,null,null,null,null,null,null,null,null,null,null,null,null,null,null,null,null,null,null,"",""]
[null,null,null,null,null,null,null,null,null,null,null,null,null,null,null,null,null,null,null,null,null,null,null,null,null,null,null,null,null,null,null,null,null,null,null,null,null,null,null,null,"",""]
[null,null,null,null,null,null,null,null,null,null,null,null,null,null,null,null,null,null,null,null,null,null,null,null,null,null,null,null,null,null,null,null,null,null,null,null,null,null,null,null,"",""]
[null,null,null,null,null,null,null,null,null,null,null,null,null,null,null,null,null,null,null,null,null,null,null,null,null,null,null,null,null,null,null,null,null,null,null,null,null,null,null,null,"",""]
[null,null,null,null,null,null,null,null,null,null,null,null,null,null,null,null,null,null,null,null,null,null,null,null,null,null,null,null,null,null,null,null,null,null,null,null,null,null,null,null,"",""]
[null,null,null,null,null,null,null,null,null,null,null,null,null,null,null,null,null,null,null,null,null,null,null,null,null,null,null,null,null,null,null,null,null,null,null,null,null,null,null,null,"",""]
[null,null,null,null,null,null,null,null,null,null,null,null,null,null,null,null,null,null,null,null,null,null,null,null,null,null,null,null,null,null,null,null,null,null,null,null,null,null,null,null,"",""]
[null,null,null,null,null,null,null,null,null,null,null,null,null,null,null,null,null,null,null,null,null,null,null,null,null,null,null,null,null,null,null,null,null,null,null,null,null,null,null,null,"",""]
[null,null,null,null,null,null,null,null,null,null,null,null,null,null,null,null,null,null,null,null,null,null,null,null,null,null,null,null,null,null,null,null,null,null,null,null,null,null,null,null,"",""]
[null,null,null,null,null,null,null,null,null,null,null,null,null,null,null,null,null,null,null,null,null,null,null,null,null,null,null,null,null,null,null,null,null,null,null,null,null,null,null,null,"",""]
[null,null,null,null,null,null,null,null,null,null,null,null,null,null,null,null,null,null,null,null,null,null,null,null,null,null,null,null,null,null,null,null,null,null,null,null,null,null,null,null,"",""]
[null,null,null,null,null,null,null,null,null,null,null,null,null,null,null,null,null,null,null,null,null,null,null,null,null,null,null,null,null,null,null,null,null,null,null,null,null,null,null,null,"",""]
[null,null,null,null,null,null,null,null,null,null,null,null,null,null,null,null,null,null,null,null,null,null,null,null,null,null,null,null,null,null,null,null,null,null,null,null,null,null,null,null,"",""]
[null,null,null,null,null,null,null,null,null,null,null,null,null,null,null,null,null,null,null,null,null,null,null,null,null,null,null,null,null,null,null,null,null,null,null,null,null,null,null,null,"",""]
[null,null,null,null,null,null,null,null,null,null,null,null,null,null,null,null,null,null,null,null,null,null,null,null,null,null,null,null,null,null,null,null,null,null,null,null,null,null,null,null,"",""]
[null,null,null,null,null,null,null,null,null,null,null,null,null,null,null,null,null,null,null,null,null,null,null,null,null,null,null,null,null,null,null,null,null,null,null,null,null,null,null,null,"",""]
[null,null,null,null,null,null,null,null,null,null,null,null,null,null,null,null,null,null,null,null,null,null,null,null,null,null,null,null,null,null,null,null,null,null,null,null,null,null,null,null,"",""]
[null,null,null,null,null,null,null,null,null,null,null,null,null,null,null,null,null,null,null,null,null,null,null,null,null,null,null,null,null,null,null,null,null,null,null,null,null,null,null,null,"",""]
[null,null,null,null,null,null,null,null,null,null,null,null,null,null,null,null,null,null,null,null,null,null,null,null,null,null,null,null,null,null,null,null,null,null,null,null,null,null,null,null,"",""]
[null,null,null,null,null,null,null,null,null,null,null,null,null,null,null,null,null,null,null,null,null,null,null,null,null,null,null,null,null,null,null,null,null,null,null,null,null,null,null,null,"",""]
[null,null,null,null,null,null,null,null,null,null,null,null,null,null,null,null,null,null,null,null,null,null,null,null,null,null,null,null,null,null,null,null,null,null,null,null,null,null,null,null,"",""]
[null,null,null,null,null,null,null,null,null,null,null,null,null,null,null,null,null,null,null,null,null,null,null,null,null,null,null,null,null,null,null,null,null,null,null,null,null,null,null,null,"",""]
[null,null,null,null,null,null,null,null,null,null,null,null,null,null,null,null,null,null,null,null,null,null,null,null,null,null,null,null,null,null,null,null,null,null,null,null,null,null,null,null,"",""]
[null,null,null,null,null,null,null,null,null,null,null,null,null,null,null,null,null,null,null,null,null,null,null,null,null,null,null,null,null,null,null,null,null,null,null,null,null,null,null,null,"",""]
[null,null,null,null,null,null,null,null,null,null,null,null,null,null,null,null,null,null,null,null,null,null,null,null,null,null,null,null,null,null,null,null,null,null,null,null,null,null,null,null,"",""]
[null,null,null,null,null,null,null,null,null,null,null,null,null,null,null,null,null,null,null,null,null,null,null,null,null,null,null,null,null,null,null,null,null,null,null,null,null,null,null,null,"",""]
[null,null,null,null,null,null,null,null,null,null,null,null,null,null,null,null,null,null,null,null,null,null,null,null,null,null,null,null,null,null,null,null,null,null,null,null,null,null,null,null,"",""]
[null,null,null,null,null,null,null,null,null,null,null,null,null,null,null,null,null,null,null,null,null,null,null,null,null,null,null,null,null,null,null,null,null,null,null,null,null,null,null,null,"",""]
[null,null,null,null,null,null,null,null,null,null,null,null,null,null,null,null,null,null,null,null,null,null,null,null,null,null,null,null,null,null,null,null,null,null,null,null,null,null,null,null,"",""]
[null,null,null,null,null,null,null,null,null,null,null,null,null,null,null,null,null,null,null,null,null,null,null,null,null,null,null,null,null,null,null,null,null,null,null,null,null,null,null,null,"",""]
[null,null,null,null,null,null,null,null,null,null,null,null,null,null,null,null,null,null,null,null,null,null,null,null,null,null,null,null,null,null,null,null,null,null,null,null,null,null,null,null,"",""]
[null,null,null,null,null,null,null,null,null,null,null,null,null,null,null,null,null,null,null,null,null,null,null,null,null,null,null,null,null,null,null,null,null,null,null,null,null,null,null,null,"",""]
[null,null,null,null,null,null,null,null,null,null,null,null,null,null,null,null,null,null,null,null,null,null,null,null,null,null,null,null,null,null,null,null,null,null,null,null,null,null,null,null,"",""]
[null,null,null,null,null,null,null,null,null,null,null,null,null,null,null,null,null,null,null,null,null,null,null,null,null,null,null,null,null,null,null,null,null,null,null,null,null,null,null,null,"",""]
[null,null,null,null,null,null,null,null,null,null,null,null,null,null,null,null,null,null,null,null,null,null,null,null,null,null,null,null,null,null,null,null,null,null,null,null,null,null,null,null,"",""]
[null,null,null,null,null,null,null,null,null,null,null,null,null,null,null,null,null,null,null,null,null,null,null,null,null,null,null,null,null,null,null,null,null,null,null,null,null,null,null,null,"",""]
[null,null,null,null,null,null,null,null,null,null,null,null,null,null,null,null,null,null,null,null,null,null,null,null,null,null,null,null,null,null,null,null,null,null,null,null,null,null,null,null,"",""]
[null,null,null,null,null,null,null,null,null,null,null,null,null,null,null,null,null,null,null,null,null,null,null,null,null,null,null,null,null,null,null,null,null,null,null,null,null,null,null,null,"",""]
[null,null,null,null,null,null,null,null,null,null,null,null,null,null,null,null,null,null,null,null,null,null,null,null,null,null,null,null,null,null,null,null,null,null,null,null,null,null,null,null,"",""]
[null,null,null,null,null,null,null,null,null,null,null,null,null,null,null,null,null,null,null,null,null,null,null,null,null,null,null,null,null,null,null,null,null,null,null,null,null,null,null,null,"",""]
[null,null,null,null,null,null,null,null,null,null,null,null,null,null,null,null,null,null,null,null,null,null,null,null,null,null,null,null,null,null,null,null,null,null,null,null,null,null,null,null,"",""]
[null,null,null,null,null,null,null,null,null,null,null,null,null,null,null,null,null,null,null,null,null,null,null,null,null,null,null,null,null,null,null,null,null,null,null,null,null,null,null,null,{"$f":"IF(AN965=\"\",\"\",IFERROR(MATCH(AN965,$AD$4:$AD$1000,0),_xlfn.XLOOKUP(AN965,$Y$4:$Y$1000,$AA$4:$AA$1000,\"\",0)))","v":""},""]
[null,null,null,null,null,null,null,null,null,null,null,null,null,null,null,null,null,null,null,null,null,null,null,null,null,null,null,null,null,null,null,null,null,null,null,null,null,null,null,null,"",""]
[null,null,null,null,null,null,null,null,null,null,null,null,null,null,null,null,null,null,null,null,null,null,null,null,null,null,null,null,null,null,null,null,null,null,null,null,null,null,null,null,"",""]
[null,null,null,null,null,null,null,null,null,null,null,null,null,null,null,null,null,null,null,null,null,null,null,null,null,null,null,null,null,null,null,null,null,null,null,null,null,null,null,null,"",""]
[null,null,null,null,null,null,null,null,null,null,null,null,null,null,null,null,null,null,null,null,null,null,null,null,null,null,null,null,null,null,null,null,null,null,null,null,null,null,null,null,"",""]
[null,null,null,null,null,null,null,null,null,null,null,null,null,null,null,null,null,null,null,null,null,null,null,null,null,null,null,null,null,null,null,null,null,null,null,null,null,null,null,null,"",""]
[null,null,null,null,null,null,null,null,null,null,null,null,null,null,null,null,null,null,null,null,null,null,null,null,null,null,null,null,null,null,null,null,null,null,null,null,null,null,null,null,"",""]
[null,null,null,null,null,null,null,null,null,null,null,null,null,null,null,null,null,null,null,null,null,null,null,null,null,null,null,null,null,null,null,null,null,null,null,null,null,null,null,null,"",""]
[null,null,null,null,null,null,null,null,null,null,null,null,null,null,null,null,null,null,null,null,null,null,null,null,null,null,null,null,null,null,null,null,null,null,null,null,null,null,null,null,"",""]
[null,null,null,null,null,null,null,null,null,null,null,null,null,null,null,null,null,null,null,null,null,null,null,null,null,null,null,null,null,null,null,null,null,null,null,null,null,null,null,null,"",""]
[null,null,null,null,null,null,null,null,null,null,null,null,null,null,null,null,null,null,null,null,null,null,null,null,null,null,null,null,null,null,null,null,null,null,null,null,null,null,null,null,"",""]
[null,null,null,null,null,null,null,null,null,null,null,null,null,null,null,null,null,null,null,null,null,null,null,null,null,null,null,null,null,null,null,null,null,null,null,null,null,null,null,null,"",""]
[null,null,null,null,null,null,null,null,null,null,null,null,null,null,null,null,null,null,null,null,null,null,null,null,null,null,null,null,null,null,null,null,null,null,null,null,null,null,null,null,"",""]
[null,null,null,null,null,null,null,null,null,null,null,null,null,null,null,null,null,null,null,null,null,null,null,null,null,null,null,null,null,null,null,null,null,null,null,null,null,null,null,null,"",""]
[null,null,null,null,null,null,null,null,null,null,null,null,null,null,null,null,null,null,null,null,null,null,null,null,null,null,null,null,null,null,null,null,null,null,null,null,null,null,null,null,"",""]
[null,null,null,null,null,null,null,null,null,null,null,null,null,null,null,null,null,null,null,null,null,null,null,null,null,null,null,null,null,null,null,null,null,null,null,null,null,null,null,null,"",""]
[null,null,null,null,null,null,null,null,null,null,null,null,null,null,null,null,null,null,null,null,null,null,null,null,null,null,null,null,null,null,null,null,null,null,null,null,null,null,null,null,"",""]
[null,null,null,null,null,null,null,null,null,null,null,null,null,null,null,null,null,null,null,null,null,null,null,null,null,null,null,null,null,null,null,null,null,null,null,null,null,null,null,null,"",{"$f":"IF(AN982=\"\",\"\",IF(N(AO982)=0,AO982,AM982))","v":""}]
[null,null,null,null,null,null,null,null,null,null,null,null,null,null,null,null,null,null,null,null,null,null,null,null,null,null,null,null,null,null,null,null,null,null,null,null,null,null,null,null,"",""]
[null,null,null,null,null,null,null,null,null,null,null,null,null,null,null,null,null,null,null,null,null,null,null,null,null,null,null,null,null,null,null,null,null,null,null,null,null,null,null,null,"",""]
[null,null,null,null,null,null,null,null,null,null,null,null,null,null,null,null,null,null,null,null,null,null,null,null,null,null,null,null,null,null,null,null,null,null,null,null,null,null,null,null,"",""]
[null,null,null,null,null,null,null,null,null,null,null,null,null,null,null,null,null,null,null,null,null,null,null,null,null,null,null,null,null,null,null,null,null,null,null,null,null,null,null,null,"",""]
[null,null,null,null,null,null,null,null,null,null,null,null,null,null,null,null,null,null,null,null,null,null,null,null,null,null,null,null,null,null,null,null,null,null,null,null,null,null,null,null,"",""]
[null,null,null,null,null,null,null,null,null,null,null,null,null,null,null,null,null,null,null,null,null,null,null,null,null,null,null,null,null,null,null,null,null,null,null,null,null,null,null,null,"",""]
[null,null,null,null,null,null,null,null,null,null,null,null,null,null,null,null,null,null,null,null,null,null,null,null,null,null,null,null,null,null,null,null,null,null,null,null,null,null,null,null,"",""]
[null,null,null,null,null,null,null,null,null,null,null,null,null,null,null,null,null,null,null,null,null,null,null,null,null,null,null,null,null,null,null,null,null,null,null,null,null,null,null,null,"",""]
[null,null,null,null,null,null,null,null,null,null,null,null,null,null,null,null,null,null,null,null,null,null,null,null,null,null,null,null,null,null,null,null,null,null,null,null,null,null,null,null,"",""]
[null,null,null,null,null,null,null,null,null,null,null,null,null,null,null,null,null,null,null,null,null,null,null,null,null,null,null,null,null,null,null,null,null,null,null,null,null,null,null,null,"",""]
[null,null,null,null,null,null,null,null,null,null,null,null,null,null,null,null,null,null,null,null,null,null,null,null,null,null,null,null,null,null,null,null,null,null,null,null,null,null,null,null,"",""]
[null,null,null,null,null,null,null,null,null,null,null,null,null,null,null,null,null,null,null,null,null,null,null,null,null,null,null,null,null,null,null,null,null,null,null,null,null,null,null,null,"",""]
[null,null,null,null,null,null,null,null,null,null,null,null,null,null,null,null,null,null,null,null,null,null,null,null,null,null,null,null,null,null,null,null,null,null,null,null,null,null,null,null,"",""]
[null,null,null,null,null,null,null,null,null,null,null,null,null,null,null,null,null,null,null,null,null,null,null,null,null,null,null,null,null,null,null,null,null,null,null,null,null,null,null,null,"",""]
[null,null,null,null,null,null,null,null,null,null,null,null,null,null,null,null,null,null,null,null,null,null,null,null,null,null,null,null,null,null,null,null,null,null,null,null,null,null,null,null,"",""]
[null,null,null,null,null,null,null,null,null,null,null,null,null,null,null,null,null,null,null,null,null,null,null,null,null,null,null,null,null,null,null,null,null,null,null,null,null,null,null,null,"",""]
[null,null,null,null,null,null,null,null,null,null,null,null,null,null,null,null,null,null,null,null,null,null,null,null,null,null,null,null,null,null,null,null,null,null,null,null,null,null,null,null,"",""]
[null,null,null,null,null,null,null,null,null,null,null,null,null,null,null,null,null,null,null,null,null,null,null,null,null,null,null,null,null,null,null,null,null,null,null,null,null,null,null,null,"",""]

{"sheet":"Sorteret vægt","index":3,"n_rows":15,"n_cols":33,"rows_kept":15,"cut":false,"hidden":false,"merged":[]}
[]
["Bygningsgrupper",null,null,null,null,null,null,"Bygningsdele",null,null,null,null,null,null,"Konstruktioner",null,null,null,null,null,null,"Byggevarer top 10",null,null,null,null,null,null,"Byggevarer top 5"]
["Nr.","Navn","Vægt [kg]","[tons]","GWP [kg CO2]",null,null,"Nr.","Navn","Vægt [kg]","[tons]","GWP [kg CO2]",null,null,"Nr.","Navn","Vægt [kg]","[tons]","GWP [kg CO2]",null,null,"Nr.","Navn","Vægt [kg]","[tons]","GWP [kg CO2]",null,null,"Nr.","Navn","Vægt [kg]","[tons]","GWP [kg CO2]"]
[null,"Alle bygningsgrupper",{"$f":"'Unikke lister'!B3","v":46763.733222854295},{"$f":"C4/1000","v":46.763733222854292},{"$f":"'Unikke lister'!E3","v":25840.012023246807},null,null,null,"Alle bygningdele",{"$f":"C4","v":46763.733222854295},{"$f":"J4/1000","v":46.763733222854292},{"$f":"E4","v":25840.012023246807},null,null,null,"Alle konstruktioner",{"$f":"J4","v":46763.733222854295},{"$f":"Q4/1000","v":46.763733222854292},{"$f":"L4","v":25840.012023246807},null,null,null,"Byggevarer total",{"$f":"Q4","v":46763.733222854295},{"$f":"X4/1000","v":46.763733222854292},{"$f":"S4","v":25840.012023246807},null,null,null,"Byggevarer total",{"$f":"X4","v":46763.733222854295},{"$f":"Y4","v":46.763733222854292},25840.012023246807]
[1,{"$f":"_xlfn.XLOOKUP(A5,'Unikke lister'!$D$4:$D$20,'Unikke lister'!$A$4:$B$20,\"\",0)","v":"Ydervægge"},16386.754699999998,{"$f":"C5/1000","v":16.386754699999997},{"$f":"_xlfn.XLOOKUP(B5,'Unikke lister'!$A$4:$A$20,'Unikke lister'!$E$4:$E$20,\"\",0)","v":4121.0747034999986},null,null,1,{"$f":"_xlfn.XLOOKUP(H5,'Unikke lister'!$T$4:$T$54,'Unikke lister'!$Q$4:$R$54,\"\",0)","v":"Ydervæg, trækassette"},16386.754699999998,{"$f":"J5/1000","v":16.386754699999997},{"$f":"_xlfn.XLOOKUP(I5,'Unikke lister'!$Q$4:$Q$54,'Unikke lister'!$U$4:$U$54,\"\",0)","v":4121.0747034999986},null,null,1,{"$f":"_xlfn.XLOOKUP(O5,'Unikke lister'!$AG$4:$AG$200,'Unikke lister'!$AD$4:$AE$200,\"\",0)","v":"Facadekassette uden beklædning"},13726.407999999999,{"$f":"Q5/1000","v":13.726407999999999},{"$f":"_xlfn.XLOOKUP(P5,'Unikke lister'!$AD$4:$AD$200,'Unikke lister'!$AH$4:$AH$200,\"\",0)","v":3463.4924923999993},null,null,1,{"$f":"_xlfn.XLOOKUP(V5,'Unikke lister'!$BA$4:$BA$300,'Unikke lister'!$AX$4:$AY$300,\"\",0)","v":"Konstruktionstræ"},12327.578799999997,{"$f":"X5/1000","v":12.327578799999998},{"$f":"_xlfn.XLOOKUP(W5,'Unikke lister'!$AX$4:$AX$300,'Unikke lister'!$BB$4:$BB$300,\"\",0)","v":1297.6398736842093},null,null,1,{"$f":"_xlfn.XLOOKUP(AC5,'Unikke lister'!$BA$4:$BA$300,'Unikke lister'!$AX$4:$AY$300,\"\",0)","v":"Konstruktionstræ"},12327.578799999997,{"$f":"AE5/1000","v":12.327578799999998},{"$f":"_xlfn.XLOOKUP(AD5,'Unikke lister'!$AX$4:$AX$300,'Unikke lister'!$BB$4:$BB$300,\"\",0)","v":1297.6398736842093}]
[2,{"$f":"_xlfn.XLOOKUP(A6,'Unikke lister'!$D$4:$D$20,'Unikke lister'!$A$4:$B$20,\"\",0)","v":"Tage"},12661.062,12.661061999999999,{"$f":"_xlfn.XLOOKUP(B6,'Unikke lister'!$A$4:$A$20,'Unikke lister'!$E$4:$E$20,\"\",0)","v":5513.0640977210533},null,null,2,{"$f":"_xlfn.XLOOKUP(H6,'Unikke lister'!$T$4:$T$54,'Unikke lister'!$Q$4:$R$54,\"\",0)","v":"Tag, trækassette"},12661.062,12.661061999999999,{"$f":"_xlfn.XLOOKUP(I6,'Unikke lister'!$Q$4:$Q$54,'Unikke lister'!$U$4:$U$54,\"\",0)","v":5513.0640977210533},null,null,2,{"$f":"_xlfn.XLOOKUP(O6,'Unikke lister'!$AG$4:$AG$200,'Unikke lister'!$AD$4:$AE$200,\"\",0)","v":"Tagkassette, ståltag"},10885.992,10.885992,{"$f":"_xlfn.XLOOKUP(P6,'Unikke lister'!$AD$4:$AD$200,'Unikke lister'!$AH$4:$AH$200,\"\",0)","v":4973.2525832210531},null,null,2,{"$f":"_xlfn.XLOOKUP(V6,'Unikke lister'!$BA$4:$BA$300,'Unikke lister'!$AX$4:$AY$300,\"\",0)","v":"Fibergips"},10095.4,10.0954,{"$f":"_xlfn.XLOOKUP(W6,'Unikke lister'!$AX$4:$AX$200,'Unikke lister'!$BB$4:$BB$200,\"\",0)","v":917.97003362779651},null,null,2,{"$f":"_xlfn.XLOOKUP(AC6,'Unikke lister'!$BA$4:$BA$300,'Unikke lister'!$AX$4:$AY$300,\"\",0)","v":"Fibergips"},10095.4,10.0954,{"$f":"_xlfn.XLOOKUP(AD6,'Unikke lister'!$AX$4:$AX$300,'Unikke lister'!$BB$4:$BB$300,\"\",0)","v":917.97003362779651}]
[3,{"$f":"_xlfn.XLOOKUP(A7,'Unikke lister'!$D$4:$D$20,'Unikke lister'!$A$4:$B$20,\"\",0)","v":"Dæk"},5343.0588000000007,5.3430588000000006,{"$f":"_xlfn.XLOOKUP(B7,'Unikke lister'!$A$4:$A$20,'Unikke lister'!$E$4:$E$20,\"\",0)","v":1200.3313305080992},null,null,3,{"$f":"_xlfn.XLOOKUP(H7,'Unikke lister'!$T$4:$T$54,'Unikke lister'!$Q$4:$R$54,\"\",0)","v":"Etagedæk, bjælkelag"},5343.0588000000007,5.3430588000000006,{"$f":"_xlfn.XLOOKUP(I7,'Unikke lister'!$Q$4:$Q$54,'Unikke lister'!$U$4:$U$54,\"\",0)","v":1200.3313305080992},null,null,3,{"$f":"_xlfn.XLOOKUP(O7,'Unikke lister'!$AG$4:$AG$200,'Unikke lister'!$AD$4:$AE$200,\"\",0)","v":"Let trækassette, terræn"},3762.08,3.7620800000000001,{"$f":"_xlfn.XLOOKUP(P7,'Unikke lister'!$AD$4:$AD$200,'Unikke lister'!$AH$4:$AH$200,\"\",0)","v":1124.3318800000002},null,null,3,{"$f":"_xlfn.XLOOKUP(V7,'Unikke lister'!$BA$4:$BA$300,'Unikke lister'!$AX$4:$AY$300,\"\",0)","v":"Papirisolering"},4965.7699999999995,4.9657699999999991,{"$f":"_xlfn.XLOOKUP(W7,'Unikke lister'!$AX$4:$AX$200,'Unikke lister'!$BB$4:$BB$200,\"\",0)","v":1519.3573999999999},null,null,3,{"$f":"_xlfn.XLOOKUP(AC7,'Unikke lister'!$BA$4:$BA$300,'Unikke lister'!$AX$4:$AY$300,\"\",0)","v":"Papirisolering"},4965.7699999999995,4.9657699999999991,{"$f":"_xlfn.XLOOKUP(AD7,'Unikke lister'!$AX$4:$AX$300,'Unikke lister'!$BB$4:$BB$300,\"\",0)","v":1519.3573999999999}]
[4,{"$f":"_xlfn.XLOOKUP(A8,'Unikke lister'!$D$4:$D$20,'Unikke lister'!$A$4:$B$20,\"\",0)","v":"Terrændæk"},4895.28,4.8952799999999996,{"$f":"_xlfn.XLOOKUP(B8,'Unikke lister'!$A$4:$A$20,'Unikke lister'!$E$4:$E$20,\"\",0)","v":1523.63153397},null,null,4,{"$f":"_xlfn.XLOOKUP(H8,'Unikke lister'!$T$4:$T$54,'Unikke lister'!$Q$4:$R$54,\"\",0)","v":"Terrændæk, trækassette"},4895.28,4.8952799999999996,{"$f":"_xlfn.XLOOKUP(I8,'Unikke lister'!$Q$4:$Q$54,'Unikke lister'!$U$4:$U$54,\"\",0)","v":1523.63153397},null,null,4,{"$f":"_xlfn.XLOOKUP(O8,'Unikke lister'!$AG$4:$AG$200,'Unikke lister'!$AD$4:$AE$200,\"\",0)","v":"Etagedæk, 70 mm gulvopbygning"},2926.4399999999996,2.9264399999999995,{"$f":"_xlfn.XLOOKUP(P8,'Unikke lister'!$AD$4:$AD$200,'Unikke lister'!$AH$4:$AH$200,\"\",0)","v":836.12325191999969},null,null,4,{"$f":"_xlfn.XLOOKUP(V8,'Unikke lister'!$BA$4:$BA$300,'Unikke lister'!$AX$4:$AY$300,\"\",0)","v":"OSB plade"},3107.34,3.1073400000000002,{"$f":"_xlfn.XLOOKUP(W8,'Unikke lister'!$AX$4:$AX$200,'Unikke lister'!$BB$4:$BB$200,\"\",0)","v":1349.9100000000003},null,null,4,{"$f":"_xlfn.XLOOKUP(AC8,'Unikke lister'!$BA$4:$BA$300,'Unikke lister'!$AX$4:$AY$300,\"\",0)","v":"OSB plade"},3107.34,3.1073400000000002,{"$f":"_xlfn.XLOOKUP(AD8,'Unikke lister'!$AX$4:$AX$300,'Unikke lister'!$BB$4:$BB$300,\"\",0)","v":1349.9100000000003}]
[5,{"$f":"_xlfn.XLOOKUP(A9,'Unikke lister'!$D$4:$D$20,'Unikke lister'!$A$4:$B$20,\"\",0)","v":"Indervægge"},3311.9280000000003,3.3119280000000004,{"$f":"_xlfn.XLOOKUP(B9,'Unikke lister'!$A$4:$A$20,'Unikke lister'!$E$4:$E$20,\"\",0)","v":1113.6426563877969},null,null,5,{"$f":"_xlfn.XLOOKUP(H9,'Unikke lister'!$T$4:$T$54,'Unikke lister'!$Q$4:$R$54,\"\",0)","v":"Indervægge"},3311.9280000000003,3.3119280000000004,{"$f":"_xlfn.XLOOKUP(I9,'Unikke lister'!$Q$4:$Q$54,'Unikke lister'!$U$4:$U$54,\"\",0)","v":1113.6426563877969},null,null,5,{"$f":"_xlfn.XLOOKUP(O9,'Unikke lister'!$AG$4:$AG$200,'Unikke lister'!$AD$4:$AE$200,\"\",0)","v":"Træbeklædning med ophæng"},1814.6428000000001,1.8146428000000001,{"$f":"_xlfn.XLOOKUP(P9,'Unikke lister'!$AD$4:$AD$200,'Unikke lister'!$AH$4:$AH$200,\"\",0)","v":435.29008160000012},null,null,5,{"$f":"_xlfn.XLOOKUP(V9,'Unikke lister'!$BA$4:$BA$300,'Unikke lister'!$AX$4:$AY$300,\"\",0)","v":"Vindspærre"},3067.2,3.0671999999999997,{"$f":"_xlfn.XLOOKUP(W9,'Unikke lister'!$AX$4:$AX$200,'Unikke lister'!$BB$4:$BB$200,\"\",0)","v":1997.088},null,null,5,{"$f":"_xlfn.XLOOKUP(AC9,'Unikke lister'!$BA$4:$BA$300,'Unikke lister'!$AX$4:$AY$300,\"\",0)","v":"Vindspærre"},3067.2,3.0671999999999997,{"$f":"_xlfn.XLOOKUP(AD9,'Unikke lister'!$AX$4:$AX$300,'Unikke lister'!$BB$4:$BB$300,\"\",0)","v":1997.088}]
[6,{"$f":"_xlfn.XLOOKUP(A10,'Unikke lister'!$D$4:$D$20,'Unikke lister'!$A$4:$B$20,\"\",0)","v":"Vinduer, døre, glasfacader"},1509.3835000000001,1.5093835000000002,{"$f":"_xlfn.XLOOKUP(B10,'Unikke lister'!$A$4:$A$20,'Unikke lister'!$E$4:$E$20,\"\",0)","v":5133.581915214997},null,null,6,{"$f":"_xlfn.XLOOKUP(H10,'Unikke lister'!$T$4:$T$54,'Unikke lister'!$Q$4:$R$54,\"\",0)","v":"Skruefundament"},1442.4387199999996,1.4424387199999997,{"$f":"_xlfn.XLOOKUP(I10,'Unikke lister'!$Q$4:$Q$54,'Unikke lister'!$U$4:$U$54,\"\",0)","v":1038.3970388273503},null,null,6,{"$f":"_xlfn.XLOOKUP(O10,'Unikke lister'!$AG$4:$AG$200,'Unikke lister'!$AD$4:$AE$200,\"\",0)","v":"Tagkassette, tagpap"},1775.0700000000002,1.7750700000000001,{"$f":"_xlfn.XLOOKUP(P10,'Unikke lister'!$AD$4:$AD$200,'Unikke lister'!$AH$4:$AH$200,\"\",0)","v":539.81151449999993},null,null,6,{"$f":"_xlfn.XLOOKUP(V10,'Unikke lister'!$BA$4:$BA$300,'Unikke lister'!$AX$4:$AY$300,\"\",0)","v":"Krydsfiner"},2867.04,2.8670399999999998,{"$f":"_xlfn.XLOOKUP(W10,'Unikke lister'!$AX$4:$AX$200,'Unikke lister'!$BB$4:$BB$200,\"\",0)","v":1207.8720000000001},null,null,null,"Resterende byggevarer",{"$f":"AE4-SUM(AE5:AE9)","v":13200.4444228543},{"$f":"AF4-SUM(AF5:AF9)","v":13.200444422854297},18758.046715934801]
[7,{"$f":"_xlfn.XLOOKUP(A11,'Unikke lister'!$D$4:$D$20,'Unikke lister'!$A$4:$B$20,\"\",0)","v":"Fundamenter"},1442.4387199999996,1.4424387199999997,{"$f":"_xlfn.XLOOKUP(B11,'Unikke lister'!$A$4:$A$20,'Unikke lister'!$E$4:$E$20,\"\",0)","v":1038.3970388273503},null,null,7,{"$f":"_xlfn.XLOOKUP(H11,'Unikke lister'!$T$4:$T$54,'Unikke lister'!$Q$4:$R$54,\"\",0)","v":"Facadevinduer "},752.40000000000009,0.75240000000000007,{"$f":"_xlfn.XLOOKUP(I11,'Unikke lister'!$Q$4:$Q$54,'Unikke lister'!$U$4:$U$54,\"\",0)","v":2783},null,null,7,{"$f":"_xlfn.XLOOKUP(O11,'Unikke lister'!$AG$4:$AG$200,'Unikke lister'!$AD$4:$AE$200,\"\",0)","v":"Etagedæk 2. sal, 230 mm bjælkelag"},1344.0239999999999,1.3440239999999999,{"$f":"_xlfn.XLOOKUP(P11,'Unikke lister'!$AD$4:$AD$200,'Unikke lister'!$AH$4:$AH$200,\"\",0)","v":209.79470298599961},null,null,7,{"$f":"_xlfn.XLOOKUP(V11,'Unikke lister'!$BA$4:$BA$300,'Unikke lister'!$AX$4:$AY$300,\"\",0)","v":"Træbeklædning"},1495.4406999999999,1.4954406999999998,{"$f":"_xlfn.XLOOKUP(W11,'Unikke lister'!$AX$4:$AX$200,'Unikke lister'!$BB$4:$BB$200,\"\",0)","v":416.54442440000008}]
[8,{"$f":"_xlfn.XLOOKUP(A12,'Unikke lister'!$D$4:$D$20,'Unikke lister'!$A$4:$B$20,\"\",0)","v":"Varme"},356.67750285429804,0.35667750285429806,{"$f":"_xlfn.XLOOKUP(B12,'Unikke lister'!$A$4:$A$20,'Unikke lister'!$E$4:$E$20,\"\",0)","v":1759.7191415451039},null,null,8,{"$f":"_xlfn.XLOOKUP(H12,'Unikke lister'!$T$4:$T$54,'Unikke lister'!$Q$4:$R$54,\"\",0)","v":"Ovenlys"},528.71249999999998,0.52871250000000003,{"$f":"_xlfn.XLOOKUP(I12,'Unikke lister'!$Q$4:$Q$54,'Unikke lister'!$U$4:$U$54,\"\",0)","v":2232.8420000000001},null,null,8,{"$f":"_xlfn.XLOOKUP(O12,'Unikke lister'!$AG$4:$AG$200,'Unikke lister'!$AD$4:$AE$200,\"\",0)","v":"Etagedæk 1. sal, 270 mm bjælkelag"},1072.5948000000001,1.0725948000000001,{"$f":"_xlfn.XLOOKUP(P12,'Unikke lister'!$AD$4:$AD$200,'Unikke lister'!$AH$4:$AH$200,\"\",0)","v":154.41337560209982},null,null,8,{"$f":"_xlfn.XLOOKUP(V12,'Unikke lister'!$BA$4:$BA$300,'Unikke lister'!$AX$4:$AY$300,\"\",0)","v":"Traægulv"},955.9,0.95589999999999997,{"$f":"_xlfn.XLOOKUP(W12,'Unikke lister'!$AX$4:$AX$200,'Unikke lister'!$BB$4:$BB$200,\"\",0)","v":557.80999999999983}]
[9,{"$f":"_xlfn.XLOOKUP(A13,'Unikke lister'!$D$4:$D$20,'Unikke lister'!$A$4:$B$20,\"\",0)","v":"Trapper og ramper"},274.3,0.27429999999999999,{"$f":"_xlfn.XLOOKUP(B13,'Unikke lister'!$A$4:$A$20,'Unikke lister'!$E$4:$E$20,\"\",0)","v":71.292105263157893},null,null,9,{"$f":"_xlfn.XLOOKUP(H13,'Unikke lister'!$T$4:$T$54,'Unikke lister'!$Q$4:$R$54,\"\",0)","v":"Trappe"},274.3,0.27429999999999999,{"$f":"_xlfn.XLOOKUP(I13,'Unikke lister'!$Q$4:$Q$54,'Unikke lister'!$U$4:$U$54,\"\",0)","v":71.292105263157893},null,null,9,{"$f":"_xlfn.XLOOKUP(O13,'Unikke lister'!$AG$4:$AG$200,'Unikke lister'!$AD$4:$AE$200,\"\",0)","v":"100 mm indervæg, krydsfiner"},820.03099999999995,0.82003099999999995,{"$f":"_xlfn.XLOOKUP(P13,'Unikke lister'!$AD$4:$AD$200,'Unikke lister'!$AH$4:$AH$200,\"\",0)","v":370.26416982500001},null,null,9,{"$f":"_xlfn.XLOOKUP(V13,'Unikke lister'!$BA$4:$BA$300,'Unikke lister'!$AX$4:$AY$300,\"\",0)","v":"Facadevindue"},752.40000000000009,0.75240000000000007,{"$f":"_xlfn.XLOOKUP(W13,'Unikke lister'!$AX$4:$AX$200,'Unikke lister'!$BB$4:$BB$200,\"\",0)","v":2783}]
[10,{"$f":"_xlfn.XLOOKUP(A14,'Unikke lister'!$D$4:$D$20,'Unikke lister'!$A$4:$B$20,\"\",0)","v":"Vand"},259,0.25900000000000001,{"$f":"_xlfn.XLOOKUP(B14,'Unikke lister'!$A$4:$A$20,'Unikke lister'!$E$4:$E$20,\"\",0)","v":2216.4083807299999},null,null,10,{"$f":"_xlfn.XLOOKUP(H14,'Unikke lister'!$T$4:$T$54,'Unikke lister'!$Q$4:$R$54,\"\",0)","v":"VVB og buffertank"},220,0.22,{"$f":"_xlfn.XLOOKUP(I14,'Unikke lister'!$Q$4:$Q$54,'Unikke lister'!$U$4:$U$54,\"\",0)","v":2077.5722000000001},null,null,10,{"$f":"_xlfn.XLOOKUP(O14,'Unikke lister'!$AG$4:$AG$200,'Unikke lister'!$AD$4:$AE$200,\"\",0)","v":"Facadevindue"},752.40000000000009,0.75240000000000007,{"$f":"_xlfn.XLOOKUP(P14,'Unikke lister'!$AD$4:$AD$200,'Unikke lister'!$AH$4:$AH$200,\"\",0)","v":2783},null,null,10,{"$f":"_xlfn.XLOOKUP(V14,'Unikke lister'!$BA$4:$BA$300,'Unikke lister'!$AX$4:$AY$300,\"\",0)","v":"Skruefundament"},750,0.75,{"$f":"_xlfn.XLOOKUP(W14,'Unikke lister'!$AX$4:$AX$200,'Unikke lister'!$BB$4:$BB$200,\"\",0)","v":845.13300000000015}]
[null,"Resterende bygningsgrupper",{"$f":"C4-SUM(C5:C14)","v":323.84999999999854},0.32384999999999853,{"$f":"E4-SUM(E5:E14)","v":2148.8691195792453},null,null,null,"Resterende bygningsdele",{"$f":"J4-SUM(J5:J14)","v":947.79850285429711},0.94779850285429712,{"$f":"L4-SUM(L5:L14)","v":4165.1643570693523},null,null,null,"Resterende konstruktioner",{"$f":"Q4-SUM(Q5:Q14)","v":7884.0506228542945},7.8840506228542946,{"$f":"S4-SUM(S5:S14)","v":10950.237971192655},null,null,null,"Resterende byggevarer",{"$f":"X4-SUM(X5:X14)","v":6379.6637228542968},{"$f":"Y4-SUM(Y5:Y14)","v":6.3796637228542892},12947.687291534801]

{"sheet":"Mængde","index":4,"n_rows":147,"n_cols":12,"rows_kept":147,"cut":false,"hidden":true,"merged":[]}
["Indeks","Gruppe","Undergruppe","Bygningsdel","Konstruktion","Byggevare","Indtastet mængde","Column4","Beregnet mængde","Column6","Vægt","Column8"]
[1,"Afløb","Faldstammer","Afløbsrør","Afløbsrør, PP","Rør, Kloakrør PP",1.5,"kg/m",37.5,"kg",37.5,"kg"]
[2,"Afløb","Nedløb fra tag","Tagrende","Nedløbsrør ","Stål, valsede profiler og plader",1.25,"kg/m",7.5,"kg",7.5,"kg"]
[3,"Afløb","Nedløb fra tag","Tagrende","Tagrende","Stål, valsede profiler og plader",1.45,"kg/m",23.925000000000001,"kg",23.925000000000001,"kg"]
[4,"Dæk","Etagedæk","Etagedæk, bjælkelag","Etagedæk 1. sal, 270 mm bjælkelag","Fastgørelsesmidler/skruer i galvaniseret stål",0.3,"kg/m²",12.03,"kg",12.03,"kg"]
[5,"Dæk","Etagedæk","Etagedæk, bjælkelag","Etagedæk 1. sal, 270 mm bjælkelag","Savede og tørrede konstruktionstræprodukter af fyr og gran, Fobrænding",3.4000000000000002E-2,"m³/m²",1.3633999999999999,"m³",621.71040000000005,"kg"]
[6,"Dæk","Etagedæk","Etagedæk, bjælkelag","Etagedæk 1. sal, 270 mm bjælkelag","Savede og tørrede konstruktionstræprodukter af fyr og gran, Fobrænding",2.4E-2,"m³/m²",0.96240000000000003,"m³",438.8544,"kg"]
[7,"Dæk","Etagedæk","Etagedæk, bjælkelag","Etagedæk 2. sal, 230 mm bjælkelag","Fastgørelsesmidler/skruer i galvaniseret stål",0.3,"kg/m²",19.8,"kg",19.8,"kg"]
[8,"Dæk","Etagedæk","Etagedæk, bjælkelag","Etagedæk 2. sal, 230 mm bjælkelag","Savede og tørrede konstruktionstræprodukter af fyr og gran, Fobrænding",4.3999999999999997E-2,"m³/m²",2.9039999999999999,"m³",1324.2239999999999,"kg"]
[9,"Dæk","Etagedæk","Etagedæk, bjælkelag","Etagedæk, 70 mm gulvopbygning","Fermacell fiberplade 12,5 mm",1,"m²/m²",66,"m²",973.5,"kg"]
[10,"Dæk","Etagedæk","Etagedæk, bjælkelag","Etagedæk, 70 mm gulvopbygning","Trinlydsdug - Scan Underlay",1,"m²/m²",66,"m²",69.3,"kg"]
[11,"Dæk","Etagedæk","Etagedæk, bjælkelag","Etagedæk, 70 mm gulvopbygning","Trægulv 14 mm ask - Tarkett Sverige",1,"m²/m²",66,"m²",521.4,"kg"]
[12,"Dæk","Etagedæk","Etagedæk, bjælkelag","Etagedæk, 70 mm gulvopbygning","WISA Gran krydsfiner, ubehandlet, Fobrænding",1.7999999999999999E-2,"m³/m²",1.1879999999999999,"m³",570.24,"kg"]
[13,"Dæk","Etagedæk","Etagedæk, bjælkelag","Etagedæk, 70 mm gulvopbygning","WISA Gran krydsfiner, ubehandlet, Fobrænding",2.5000000000000001E-2,"m³/m²",1.65,"m³",792.00000000000011,"kg"]
[14,"El- og mekaniske anlæg","Energiproduktion","Solceller","Solceller, Sunpower","Solceller, Sunpower",1,"m²/m²",10.6,"m²",201.4,"kg"]
[15,"Fundamenter","Punktfundament","Skruefundament","Krinner V114x5-M24","Stål, valsede profiler og plader",7,"kg/stk.",112,"kg",112,"kg"]
[16,"Fundamenter","Punktfundament","Skruefundament","Krinner V114x5x2000","Stål, valsede profiler og plader",29,"kg/stk.",464,"kg",464,"kg"]
[17,"Fundamenter","Punktfundament","Skruefundament","Krinner V140x6,3-M24","Stål, valsede profiler og plader",10,"kg/stk.",30,"kg",30,"kg"]
[18,"Fundamenter","Punktfundament","Skruefundament","Krinner V140x6,3x2000 ","Stål, valsede profiler og plader",48,"kg/stk.",144,"kg",144,"kg"]
[19,"Fundamenter","Punktfundament","Skruefundament","Rem 200x185, limtræ","Fastgørelsesmidler/skruer i galvaniseret stål",8.6209999999999995E-2,"kg/m",1.3793599999999999,"kg",1.3793599999999999,"kg"]
[20,"Fundamenter","Punktfundament","Skruefundament","Rem 200x185, limtræ","Limtræs-produkter af fyr og gran, Fobrænding",3.6999999999999998E-2,"m³/m",0.59199999999999997,"m³",296,"kg"]
[21,"Fundamenter","Punktfundament","Skruefundament","Rem 266x185, limtræ","Fastgørelsesmidler/skruer i galvaniseret stål",8.6209999999999995E-2,"kg/m",1.3793599999999999,"kg",1.3793599999999999,"kg"]
[22,"Fundamenter","Punktfundament","Skruefundament","Rem 266x185, limtræ","Limtræs-produkter af fyr og gran, Fobrænding",4.9209999999999997E-2,"m³/m",0.78735999999999995,"m³",393.67999999999989,"kg"]
[23,"Indervægge","Bærende indervægge","Indervægge","100 mm indervæg, fibergips","Fermacell fiberplade 12,5 mm",1.2,"m²/m²",30,"m²",442.5,"kg"]
[24,"Indervægge","Bærende indervægge","Indervægge","100 mm indervæg, fibergips","Fermacell fiberplade 12,5 mm",1.2,"kg/m²",2.0338983050847461,"m²",30,"kg"]
[25,"Indervægge","Bærende indervægge","Indervægge","100 mm indervæg, fibergips","Savede og tørrede konstruktionstræprodukter af fyr og gran, Fobrænding",1.0500000000000001E-2,"m³/m²",0.26250000000000001,"m³",119.7,"kg"]
[26,"Indervægge","Bærende indervægge","Indervægge","100 mm indervæg, fibergips","Træfiberisolering (bats), kl. 38 - Hunton",5.9499999999999997E-2,"m³/m²",1.4875,"m³",74.374999999999986,"kg"]
[27,"Indervægge","Bærende indervægge","Indervægge","100 mm indervæg, krydsfiner","Savede og tørrede konstruktionstræprodukter af fyr og gran, Fobrænding",1.0500000000000001E-2,"m³/m²",0.38850000000000001,"m³",177.15600000000001,"kg"]
[28,"Indervægge","Bærende indervægge","Indervægge","100 mm indervæg, krydsfiner","Træfiberisolering (bats), kl. 38 - Hunton",5.9499999999999997E-2,"m³/m²",2.2014999999999998,"m³",110.075,"kg"]
[29,"Indervægge","Bærende indervægge","Indervægge","100 mm indervæg, krydsfiner","WISA Gran krydsfiner, ubehandlet, Fobrænding",1.4999999999999999E-2,"m³/m²",0.55499999999999994,"m³",266.39999999999998,"kg"]
[30,"Indervægge","Bærende indervægge","Indervægge","100 mm indervæg, krydsfiner","WISA Gran krydsfiner, ubehandlet, Fobrænding",1.4999999999999999E-2,"m³/m²",0.55499999999999994,"m³",266.39999999999998,"kg"]
[31,"Indervægge","Bærende indervægge","Indervægge","100 mm indervæg, krydsfiner og fibergips","Fermacell fiberplade 12,5 mm",1.2,"m²/m²",6,"m²",88.5,"kg"]
[32,"Indervægge","Bærende indervægge","Indervægge","100 mm indervæg, krydsfiner og fibergips","Savede og tørrede konstruktionstræprodukter af fyr og gran, Fobrænding",1.0500000000000001E-2,"m³/m²",5.2499999999999998E-2,"m³",23.94,"kg"]
[33,"Indervægge","Bærende indervægge","Indervægge","100 mm indervæg, krydsfiner og fibergips","Træfiberisolering (bats), kl. 38 - Hunton",5.9499999999999997E-2,"m³/m²",0.29749999999999999,"m³",14.875,"kg"]
[34,"Indervægge","Bærende indervægge","Indervægge","100 mm indervæg, krydsfiner og fibergips","WISA Gran krydsfiner, ubehandlet, Fobrænding",1.4999999999999999E-2,"m³/m²",7.4999999999999997E-2,"m³",36,"kg"]
[35,"Indervægge","Bærende indervægge","Indervægge","110 mm indervæg mod bad, krydsfiner og fibergips med klinker ","Fermacell fiberplade 12,5 mm",1.2,"m²/m²",7.1999999999999993,"m²",106.2,"kg"]
[36,"Indervægge","Bærende indervægge","Indervægge","110 mm indervæg mod bad, krydsfiner og fibergips med klinker ","Keramikfliser, glaseret",1,"m²/m²",6,"m²",120,"kg"]
[37,"Indervægge","Bærende indervægge","Indervægge","110 mm indervæg mod bad, krydsfiner og fibergips med klinker ","Mørtel, fliseklæber",3.1,"kg/m²",18.600000000000001,"kg",18.600000000000001,"kg"]
[38,"Indervægge","Bærende indervægge","Indervægge","110 mm indervæg mod bad, krydsfiner og fibergips med klinker ","Savede og tørrede konstruktionstræprodukter af fyr og gran, Fobrænding",1.0500000000000001E-2,"m³/m²",6.3E-2,"m³",28.728000000000002,"kg"]
[39,"Indervægge","Bærende indervægge","Indervægge","110 mm indervæg mod bad, krydsfiner og fibergips med klinker ","Træfiberisolering (bats), kl. 38 - Hunton",5.9499999999999997E-2,"m³/m²",0.35699999999999998,"m³",17.850000000000001,"kg"]
[40,"Indervægge","Bærende indervægge","Indervægge","110 mm indervæg mod bad, krydsfiner og fibergips med klinker ","Vandtætningsmembran, flydende",1.2,"kg/m²",7.1999999999999993,"kg",7.1999999999999993,"kg"]
[41,"Indervægge","Bærende indervægge","Indervægge","110 mm indervæg mod bad, krydsfiner og fibergips med klinker ","WISA Gran krydsfiner, ubehandlet, Fobrænding",1.4999999999999999E-2,"m³/m²",0.09,"m³",43.2,"kg"]
[42,"Indervægge","Bærende indervægge","Indervægge","150 mm indervæg mod bad, krydsfiner og fibergips med klinker","Fermacell fiberplade 12,5 mm",1.2,"m²/m²",7.1999999999999993,"m²",106.2,"kg"]
[43,"Indervægge","Bærende indervægge","Indervægge","150 mm indervæg mod bad, krydsfiner og fibergips med klinker","Keramikfliser, glaseret",1,"m²/m²",6,"m²",120,"kg"]
[44,"Indervægge","Bærende indervægge","Indervægge","150 mm indervæg mod bad, krydsfiner og fibergips med klinker","Mørtel, fliseklæber",3.1,"kg/m²",18.600000000000001,"kg",18.600000000000001,"kg"]
[45,"Indervægge","Bærende indervægge","Indervægge","150 mm indervæg mod bad, krydsfiner og fibergips med klinker","Savede og tørrede konstruktionstræprodukter af fyr og gran, Fobrænding",1.6500000000000001E-2,"m³/m²",9.9000000000000005E-2,"m³",45.144000000000013,"kg"]
[46,"Indervægge","Bærende indervægge","Indervægge","150 mm indervæg mod bad, krydsfiner og fibergips med klinker","Træfiberisolering (bats), kl. 38 - Hunton",9.35E-2,"m³/m²",0.56099999999999994,"m³",28.05,"kg"]
[47,"Indervægge","Bærende indervægge","Indervægge","150 mm indervæg mod bad, krydsfiner og fibergips med klinker","Vandtætningsmembran, flydende",1.2,"kg/m²",7.1999999999999993,"kg",7.1999999999999993,"kg"]
[48,"Indervægge","Bærende indervægge","Indervægge","150 mm indervæg mod bad, krydsfiner og fibergips med klinker","WISA Gran krydsfiner, ubehandlet, Fobrænding",1.4999999999999999E-2,"m³/m²",0.09,"m³",43.2,"kg"]
[49,"Indervægge","Bærende indervægge","Indervægge","45 mm indervæg mod skakt, krydsfiner","Savede og tørrede konstruktionstræprodukter af fyr og gran, Fobrænding",5.0000000000000001E-3,"m³/m²",0.11,"m³",50.16,"kg"]
[50,"Indervægge","Bærende indervægge","Indervægge","45 mm indervæg mod skakt, krydsfiner","WISA Gran krydsfiner, ubehandlet, Fobrænding",0.03,"m³/m²",0.65999999999999992,"m³",316.8,"kg"]
[51,"Indervægge","Bærende indervægge","Indervægge","60 mm skunkvægge, krydsfiner","Savede og tørrede konstruktionstræprodukter af fyr og gran, Fobrænding",7.0000000000000001E-3,"m³/m²",0.14000000000000001,"m³",63.84,"kg"]
[52,"Indervægge","Bærende indervægge","Indervægge","60 mm skunkvægge, krydsfiner","WISA Gran krydsfiner, ubehandlet, Fobrænding",1.4999999999999999E-2,"m³/m²",0.3,"m³",144,"kg"]
[53,"Indervægge","Bærende indervægge","Indervægge","80 mm indervæg, krydsfiner","Savede og tørrede konstruktionstræprodukter af fyr og gran, Fobrænding",7.4999999999999997E-3,"m³/m²",2.2499999999999999E-2,"m³",10.26,"kg"]
[54,"Indervægge","Bærende indervægge","Indervægge","80 mm indervæg, krydsfiner","Træfiberisolering (bats), kl. 38 - Hunton",4.2500000000000003E-2,"m³/m²",0.1275,"m³",6.375,"kg"]
[55,"Indervægge","Bærende indervægge","Indervægge","80 mm indervæg, krydsfiner","WISA Gran krydsfiner, ubehandlet, Fobrænding",1.4999999999999999E-2,"m³/m²",4.4999999999999998E-2,"m³",21.6,"kg"]
[56,"Indervægge","Bærende indervægge","Indervægge","80 mm indervæg, krydsfiner","WISA Gran krydsfiner, ubehandlet, Fobrænding",1.4999999999999999E-2,"m³/m²",4.4999999999999998E-2,"m³",21.6,"kg"]
[57,"Indervægge","Bærende indervægge","Indervægge","Klinkebeklædning på badeværelse","Keramikfliser, glaseret",1,"m²/m²",13,"m²",260,"kg"]
[58,"Indervægge","Bærende indervægge","Indervægge","Klinkebeklædning på badeværelse","Mørtel, fliseklæber",3.2,"kg/m²",41.6,"kg",41.6,"kg"]
[59,"Indervægge","Bærende indervægge","Indervægge","Klinkebeklædning på badeværelse","Vandtætningsmembran, flydende",1.2,"kg/m²",15.6,"kg",15.6,"kg"]
[60,"Søjler og bjælker","Søjler","Træsøjle","Limtræssøjle 140 x 140 mm","Limtræs-produkter af fyr og gran, Fobrænding",5.1999999999999998E-2,"m³/stk.",0.104,"m³",52,"kg"]
[61,"Tage","Tage","Tag, trækassette","Tagkassette, ståltag","Asfaltimprægneret porøs træfiberplade, 18 mm - Hunton Undertag",1.39,"m²/m²",154.29,"m²",709.73399999999992,"kg"]
[62,"Tage","Tage","Tag, trækassette","Tagkassette, ståltag","Dampspærre PE (tykkelse 0,0002 m)",1,"m²/m²",111,"m²",22.2,"kg"]
[63,"Tage","Tage","Tag, trækassette","Tagkassette, ståltag","Fermacell fiberplade 12,5 mm",2,"m²/m²",222,"m²",3274.5,"kg"]
[64,"Tage","Tage","Tag, trækassette","Tagkassette, ståltag","Galvaniseret stålplade - Plannja",5.5,"kg/m²",610.5,"kg",610.5,"kg"]
[65,"Tage","Tage","Tag, trækassette","Tagkassette, ståltag","OSB-plade",1.7999999999999999E-2,"m³/m²",1.998,"m³",1198.8,"kg"]
[66,"Tage","Tage","Tag, trækassette","Tagkassette, ståltag","Papirisolering kl 37 - ISOCELL",13.6,"kg/m²",1509.6,"kg",1509.6,"kg"]
[67,"Tage","Tage","Tag, trækassette","Tagkassette, ståltag","Papirisolering kl 37 - ISOCELL",1.8,"kg/m²",199.8,"kg",199.8,"kg"]
[68,"Tage","Tage","Tag, trækassette","Tagkassette, ståltag","Savede og tørrede konstruktionstræprodukter af fyr og gran, Fobrænding",7.0000000000000001E-3,"m³/m²",0.77700000000000002,"m³",354.31200000000001,"kg"]
[69,"Tage","Tage","Tag, trækassette","Tagkassette, ståltag","Savede og tørrede konstruktionstræprodukter af fyr og gran, Fobrænding",2E-3,"kg/m²",4.8684210526315792E-4,"m³",0.222,"kg"]
[70,"Tage","Tage","Tag, trækassette","Tagkassette, ståltag","Savede og tørrede konstruktionstræprodukter af fyr og gran, Fobrænding",8.0000000000000002E-3,"m³/m²",0.88800000000000001,"m³",404.928,"kg"]
[71,"Tage","Tage","Tag, trækassette","Tagkassette, ståltag","Savede og tørrede konstruktionstræprodukter af fyr og gran, Fobrænding",4.3999999999999997E-2,"m³/m²",4.8839999999999986,"m³",2227.1039999999998,"kg"]
[72,"Tage","Tage","Tag, trækassette","Tagkassette, ståltag","Savede og tørrede konstruktionstræprodukter af fyr og gran, Fobrænding",7.0000000000000001E-3,"m³/m²",0.77700000000000002,"m³",354.31200000000001,"kg"]
[73,"Tage","Tage","Tag, trækassette","Tagkassette, tagpap","Dampspærre PE (tykkelse 0,0002 m)",1,"m²/m²",15,"m²",3,"kg"]
[74,"Tage","Tage","Tag, trækassette","Tagkassette, tagpap","Derbigum NT",1,"m²/m²",15,"m²",132.15,"kg"]
[75,"Tage","Tage","Tag, trækassette","Tagkassette, tagpap","Fermacell fiberplade 12,5 mm",2,"m²/m²",30,"m²",442.5,"kg"]
[76,"Tage","Tage","Tag, trækassette","Tagkassette, tagpap","Papirisolering kl 37 - ISOCELL",13.6,"kg/m²",204,"kg",204,"kg"]
[77,"Tage","Tage","Tag, trækassette","Tagkassette, tagpap","Papirisolering kl 37 - ISOCELL",1.8,"kg/m²",27,"kg",27,"kg"]
[78,"Tage","Tage","Tag, trækassette","Tagkassette, tagpap","Savede og tørrede konstruktionstræprodukter af fyr og gran, Fobrænding",1.0999999999999999E-2,"m³/m²",0.16500000000000001,"m³",75.239999999999995,"kg"]
[79,"Tage","Tage","Tag, trækassette","Tagkassette, tagpap","Savede og tørrede konstruktionstræprodukter af fyr og gran, Fobrænding",1.0999999999999999E-2,"m³/m²",0.16500000000000001,"m³",75.239999999999995,"kg"]
[80,"Tage","Tage","Tag, trækassette","Tagkassette, tagpap","Savede og tørrede konstruktionstræprodukter af fyr og gran, Fobrænding",4.3999999999999997E-2,"m³/m²",0.65999999999999992,"m³",300.95999999999998,"kg"]
[81,"Tage","Tage","Tag, trækassette","Tagkassette, tagpap","Savede og tørrede konstruktionstræprodukter af fyr og gran, Fobrænding",7.0000000000000001E-3,"m³/m²",0.105,"m³",47.88,"kg"]
[82,"Tage","Tage","Tag, trækassette","Tagkassette, tagpap","WISA Gran krydsfiner, ubehandlet, Fobrænding",2.1000000000000001E-2,"m³/m²",0.315,"m³",151.19999999999999,"kg"]
[83,"Tage","Tage","Tag, trækassette","Tagkassette, tagpap","WISA Gran krydsfiner, ubehandlet, Fobrænding",2.1000000000000001E-2,"m³/m²",0.315,"m³",151.19999999999999,"kg"]
[84,"Terrændæk","Terrændæk","Terrændæk, trækassette","Gulv, vådrumsgulv, keramiske fliser","Afretningslag, cementbaseret",120,"kg/m²",600,"kg",600,"kg"]
[85,"Terrændæk","Terrændæk","Terrændæk, trækassette","Gulv, vådrumsgulv, keramiske fliser","EPS isolering til lofter / gulve og kælderydervæg / terrændæk 040",3.0000000000000001E-3,"m³/m²",1.4999999999999999E-2,"m³",0.27750000000000002,"kg"]
[86,"Terrændæk","Terrændæk","Terrændæk, trækassette","Gulv, vådrumsgulv, keramiske fliser","Keramikfliser, glaseret",1,"m²/m²",5,"m²",100,"kg"]
[87,"Terrændæk","Terrændæk","Terrændæk, trækassette","Gulv, vådrumsgulv, keramiske fliser","Mørtel, fliseklæber",3.1,"kg/m²",15.5,"kg",15.5,"kg"]
[88,"Terrændæk","Terrændæk","Terrændæk, trækassette","Gulv, vådrumsgulv, keramiske fliser","Vandtætningsmembran, flydende",1.2,"kg/m²",6,"kg",6,"kg"]
[89,"Terrændæk","Terrændæk","Terrændæk, trækassette","Let trækassette, terræn","Cembrit Windstopper Extreme, 9 mm",1,"m²/m²",56,"m²",806.4,"kg"]
[90,"Terrændæk","Terrændæk","Terrændæk, trækassette","Let trækassette, terræn","Dampspærre PE (tykkelse 0,0002 m)",1,"m²/m²",56,"m²",11.2,"kg"]
[91,"Terrændæk","Terrændæk","Terrændæk, trækassette","Let trækassette, terræn","Papirisolering kl 37 - ISOCELL",14.3,"kg/m²",800.80000000000007,"kg",800.80000000000007,"kg"]
[92,"Terrændæk","Terrændæk","Terrændæk, trækassette","Let trækassette, terræn","Savede og tørrede konstruktionstræprodukter af fyr og gran, Fobrænding",5.5E-2,"m³/m²",3.08,"m³",1404.48,"kg"]
[93,"Terrændæk","Terrændæk","Terrændæk, trækassette","Let trækassette, terræn","Spaandex spånplader, Spaandex spånplader (DK)",13.2,"kg/m²",739.19999999999993,"kg",739.19999999999993,"kg"]
[94,"Terrændæk","Terrændæk","Terrændæk, trækassette","Trægulv terrændæk","Trinlydsdug - Scan Underlay",1,"m²/m²",46,"m²",48.3,"kg"]
[95,"Terrændæk","Terrændæk","Terrændæk, trækassette","Trægulv terrændæk","Trægulv 14 mm ask - Tarkett Sverige",1,"m²/m²",46,"m²",363.4,"kg"]
[96,"Trapper og ramper","Trapper og ramper","Trappe","Trætrappe pr. etage","Savede og tørrede konstruktionstræprodukter af fyr og gran, Fobrænding",80,"kg/stk.",0.35087719298245612,"m³",160,"kg"]
[97,"Trapper og ramper","Trapper og ramper","Trappe","Trætrappe pr. etage","Trægulv 14 mm ask - Tarkett Sverige",4.5,"m²/stk.",9,"m²",71.100000000000009,"kg"]
[98,"Trapper og ramper","Trapper og ramper","Trappe","Trætrappe pr. etage","WISA Gran krydsfiner, ubehandlet, Fobrænding",4.4999999999999998E-2,"m³/stk.",0.09,"m³",43.2,"kg"]
[99,"Vand","Vandrør","Vandrør","Rustfrit stålrør","Brugsvandsrør, rustfri stål",1.3,"kg/m",39,"kg",39,"kg"]
[100,"Vand","Varmtvandsbeholder","VVB og buffertank","Metroair 330, indedel til VP","Buffertank, rustfri stål",220,"kg/stk.",220,"kg",220,"kg"]
[101,"Varme","Andet (varme) ","Pumpe","Magna3 25-40","Magna3 25-(40/60/80/100/120)",1,"stk./stk.",1,"stk.",6.41,"kg"]
[102,"Varme","Radiatorer","Radiator ","Radiator, 142/2000","Panel radiator 500mm x 700mm - Lyngson",0.81142857099999999,"stk./stk.",0.81142857099999999,"stk.",16.158788562893999,"kg"]
[103,"Varme","Radiatorer","Radiator ","Radiator, 200/1000","Panel radiator 500mm x 700mm - Lyngson",0.571428571,"stk./stk.",1.142857142,"stk.",22.758857125788001,"kg"]
[104,"Varme","Radiatorer","Radiator ","Radiator, 200/1100","Panel radiator 500mm x 700mm - Lyngson",0.62857142899999996,"stk./stk.",0.62857142899999996,"stk.",12.517371437106,"kg"]
[105,"Varme","Radiatorer","Radiator ","Radiator, 200/2000","Panel radiator 500mm x 700mm - Lyngson",1.1428571430000001,"stk./stk.",2.2857142860000002,"stk.",45.517714291403998,"kg"]
[106,"Varme","Radiatorer","Radiator ","Radiator, 200/600","Panel radiator 500mm x 700mm - Lyngson",0.34285714299999998,"stk./stk.",0.34285714299999998,"stk.",6.8276571457020001,"kg"]
[107,"Varme","Radiatorer","Radiator ","Radiator, 300/400","Panel radiator 500mm x 700mm - Lyngson",0.34285714299999998,"stk./stk.",0.34285714299999998,"stk.",6.8276571457020001,"kg"]
[108,"Varme","Radiatorer","Radiator ","Radiator, 600/900","Panel radiator 500mm x 700mm - Lyngson",1.542857143,"stk./stk.",1.542857143,"stk.",30.724457145702001,"kg"]
[109,"Varme","Varmeforsyningsanlæg","Varmepumpe","Varmepumpe luft til vand ","Varmepumpe (luft-vand) 10 kW",0.62,"stk./stk.",0.62,"stk.",83.08,"kg"]
[110,"Varme","Varmerør","Varmerør","Press rør","Brugsvandsrør, rustfri stål",1.2585500000000001,"kg/m",125.855,"kg",125.855,"kg"]
[111,"Ventilation og køl ","Ventilationskanaler","Afkast emhætte","Ventilationskanaler Ø125, enfamiliehuse og etageboliger, central","Ventilationskanal, galvaniseret stål",1.5249999999999999,"kg/m",1.5249999999999999,"kg",1.5249999999999999,"kg"]
[112,"Vinduer, døre, glasfacader","Døre","Indvendige døre","Dør, indvendig","Fastgørelsesmidler/skruer i galvaniseret stål",1,"kg/stk.",4,"kg",4,"kg"]
[113,"Vinduer, døre, glasfacader","Døre","Indvendige døre","Dør, indvendig","Overflade, Indendørsmaling, emulsions maling, slidstærk",0.35749999999999998,"kg/stk.",1.43,"kg",1.43,"kg"]
[114,"Vinduer, døre, glasfacader","Døre","Indvendige døre","Dør, indvendig","Spånplade",33,"kg/stk.",0.18857142857142861,"m³",132,"kg"]
[115,"Vinduer, døre, glasfacader","Døre","Indvendige døre","Dør, indvendig","Træ, fyrretræ (12% fugt / 10,7% H2O)",10,"kg/stk.",7.2886297376093298E-2,"m³",40,"kg"]
[116,"Vinduer, døre, glasfacader","Døre","Udvendig dør","Udvendig dør, træ","Grå støbejern",0.05,"kg/m²",0.105,"kg",0.105,"kg"]
[117,"Vinduer, døre, glasfacader","Døre","Udvendig dør","Udvendig dør, træ","Høvlede konstruktionstræsprodukter af fyr og gran, Fobrænding",1.63,"kg/m²",7.5065789473684214E-3,"m³",3.423,"kg"]
[118,"Vinduer, døre, glasfacader","Døre","Udvendig dør","Udvendig dør, træ","Savede og tørrede konstruktionstræprodukter af fyr og gran, Fobrænding",22.53,"kg/m²",0.10375657894736839,"m³",47.313000000000002,"kg"]
[119,"Vinduer, døre, glasfacader","Vinduer","Facadevinduer ","Facadevinduer","3-lags-rude",0.85,"m²/m²",18.7,"m²",561,"kg"]
[120,"Vinduer, døre, glasfacader","Vinduer","Facadevinduer ","Facadevinduer","Trævindue med 3-lags rude",1,"m²/m²",22,"m²",752.40000000000009,"kg"]
[121,"Vinduer, døre, glasfacader","Vinduer","Ovenlys","Velux GGL ovenlys m. aluinddækning, 3-lagsrude (træ)","3-lags-rude",0.85,"m²/m²",7.6499999999999986,"m²",229.5,"kg"]
[122,"Vinduer, døre, glasfacader","Vinduer","Ovenlys","Velux GGL ovenlys m. aluinddækning, 3-lagsrude (træ)","Velux GGL ovenlys m. aluinddækning, 3-lagsrude (træ)",1,"m²/m²",9,"m²",394.3125,"kg"]
[123,"Vinduer, døre, glasfacader","Vinduer","Ovenlys","Velux modular skylight, 3-lagsrude","3-lags-rude",0.85,"m²/m²",1.7,"m²",51,"kg"]
[124,"Vinduer, døre, glasfacader","Vinduer","Ovenlys","Velux modular skylight, 3-lagsrude","Velux modular skylight, 3-lagsrude",1,"m²/m²",2,"m²",134.4,"kg"]
[125,"Ydervægge","Ydervægge","Ydervæg, trækassette","Facadekassette uden beklædning","Cembrit Windstopper Extreme, 9 mm",1,"m²/m²",148,"m²",2131.1999999999998,"kg"]
[126,"Ydervægge","Ydervægge","Ydervæg, trækassette","Facadekassette uden beklædning","Dampspærre PE (tykkelse 0,0002 m)",1,"m²/m²",148,"m²",29.6,"kg"]
[127,"Ydervægge","Ydervægge","Ydervæg, trækassette","Facadekassette uden beklædning","Fermacell fiberplade 12,5 mm",2,"m²/m²",296,"m²",4366,"kg"]
[128,"Ydervægge","Ydervægge","Ydervæg, trækassette","Facadekassette uden beklædning","OSB-plade",1.7999999999999999E-2,"m³/m²",2.6640000000000001,"m³",1598.4,"kg"]
[129,"Ydervægge","Ydervægge","Ydervæg, trækassette","Facadekassette uden beklædning","Papirisolering kl 37 - ISOCELL",12.5,"kg/m²",1850,"kg",1850,"kg"]
[130,"Ydervægge","Ydervægge","Ydervæg, trækassette","Facadekassette uden beklædning","Papirisolering kl 37 - ISOCELL",1.91,"kg/m²",282.68,"kg",282.68,"kg"]
[131,"Ydervægge","Ydervægge","Ydervæg, trækassette","Facadekassette uden beklædning","Savede og tørrede konstruktionstræprodukter af fyr og gran, Fobrænding",4.3999999999999997E-2,"m³/m²",6.5119999999999996,"m³",2969.4720000000002,"kg"]
[132,"Ydervægge","Ydervægge","Ydervæg, trækassette","Facadekassette uden beklædning","Savede og tørrede konstruktionstræprodukter af fyr og gran, Fobrænding",7.0000000000000001E-3,"m³/m²",1.036,"m³",472.416,"kg"]
[133,"Ydervægge","Ydervægge","Ydervæg, trækassette","Tilbagetrukket facadekassette uden beklædning","Cembrit Windstopper Extreme, 9 mm",1,"m²/m²",9,"m²",129.6,"kg"]
[134,"Ydervægge","Ydervægge","Ydervæg, trækassette","Tilbagetrukket facadekassette uden beklædning","Dampspærre PE (tykkelse 0,0002 m)",1,"m²/m²",9,"m²",1.8,"kg"]
[135,"Ydervægge","Ydervægge","Ydervæg, trækassette","Tilbagetrukket facadekassette uden beklædning","Fermacell fiberplade 12,5 mm",2,"m²/m²",18,"m²",265.5,"kg"]
[136,"Ydervægge","Ydervægge","Ydervæg, trækassette","Tilbagetrukket facadekassette uden beklædning","OSB-plade",1.7999999999999999E-2,"m³/m²",0.16200000000000001,"m³",97.199999999999989,"kg"]
[137,"Ydervægge","Ydervægge","Ydervæg, trækassette","Tilbagetrukket facadekassette uden beklædning","Papirisolering kl 37 - ISOCELL",8.3000000000000007,"kg/m²",74.7,"kg",74.7,"kg"]
[138,"Ydervægge","Ydervægge","Ydervæg, trækassette","Tilbagetrukket facadekassette uden beklædning","Papirisolering kl 37 - ISOCELL",1.91,"kg/m²",17.190000000000001,"kg",17.190000000000001,"kg"]
[139,"Ydervægge","Ydervægge","Ydervæg, trækassette","Tilbagetrukket facadekassette uden beklædning","Savede og tørrede konstruktionstræprodukter af fyr og gran, Fobrænding",2.9000000000000001E-2,"m³/m²",0.26100000000000001,"m³",119.01600000000001,"kg"]
[140,"Ydervægge","Ydervægge","Ydervæg, trækassette","Tilbagetrukket facadekassette uden beklædning","Savede og tørrede konstruktionstræprodukter af fyr og gran, Fobrænding",7.0000000000000001E-3,"m³/m²",6.3E-2,"m³",28.728000000000002,"kg"]
[141,"Ydervægge","Ydervægge","Ydervæg, trækassette","Træbeklædning med ophæng","Savede og tørrede konstruktionstræprodukter af fyr og gran, Fobrænding",2E-3,"m³/m²",0.29599999999999999,"m³",134.976,"kg"]
[142,"Ydervægge","Ydervægge","Ydervæg, trækassette","Træbeklædning med ophæng","Savede og tørrede konstruktionstræprodukter af fyr og gran, Fobrænding",4.0000000000000001E-3,"m³/m²",0.59199999999999997,"m³",269.952,"kg"]
[143,"Ydervægge","Ydervægge","Ydervæg, trækassette","Træbeklædning med ophæng","Træbeklædning 19 mm, ubehandlet gran - InnTre Kjeldstad AS",1.105,"m²/m²",163.54,"m²",1409.7148,"kg"]
[144,"Ydervægge","Ydervægge","Ydervæg, trækassette","Træbeklædning tilbagetrukket med ophæng","Savede og tørrede konstruktionstræprodukter af fyr og gran, Fobrænding",2E-3,"m³/m²",1.7999999999999999E-2,"m³",8.2080000000000002,"kg"]
[145,"Ydervægge","Ydervægge","Ydervæg, trækassette","Træbeklædning tilbagetrukket med ophæng","Savede og tørrede konstruktionstræprodukter af fyr og gran, Fobrænding",4.0000000000000001E-3,"m³/m²",3.5999999999999997E-2,"m³",16.416,"kg"]
[146,"Ydervægge","Ydervægge","Ydervæg, trækassette","Træbeklædning tilbagetrukket med ophæng","Træbeklædning 19 mm, ubehandlet gran - InnTre Kjeldstad AS",1.105,"m²/m²",9.9450000000000003,"m²",85.725899999999996,"kg"]

{"sheet":"Indtastninger","index":5,"n_rows":147,"n_cols":9,"rows_kept":147,"cut":false,"hidden":true,"merged":[]}
["Indeks","Beskrivelse","Navn","Kilde","Medregnet","Mængde","Enhed","Levetid","Usikkerhedsfaktor"]
[1,"Byggevare","Rør, Kloakrør PP","GenDk",true,1.5,"kg/m",50,1]
[2,"Byggevare","Stål, valsede profiler og plader","GenDk",true,1.25,"kg/m",60,1]
[3,"Byggevare","Stål, valsede profiler og plader","GenDk",true,1.45,"kg/m",60,1]
[4,"Byggevare","Fastgørelsesmidler/skruer i galvaniseret stål","GenDk",true,0.3,"kg/m²",100,1]
[5,"Byggevare","Savede og tørrede konstruktionstræprodukter af fyr og gran, Fobrænding","EPDDanmark",true,3.4000000000000002E-2,"m³/m²",100,1]
[6,"Byggevare","Savede og tørrede konstruktionstræprodukter af fyr og gran, Fobrænding","EPDDanmark",true,2.4E-2,"m³/m²",100,1]
[7,"Byggevare","Fastgørelsesmidler/skruer i galvaniseret stål","GenDk",true,0.3,"kg/m²",100,1]
[8,"Byggevare","Savede og tørrede konstruktionstræprodukter af fyr og gran, Fobrænding","EPDDanmark",true,4.3999999999999997E-2,"m³/m²",100,1]
[9,"Byggevare","Fermacell fiberplade 12,5 mm","User",true,1,"m²/m²",60,1]
[10,"Byggevare","Trinlydsdug - Scan Underlay","User",true,1,"m²/m²",60,1]
[11,"Byggevare","Trægulv 14 mm ask - Tarkett Sverige","User",true,1,"m²/m²",60,1]
[12,"Byggevare","WISA Gran krydsfiner, ubehandlet, Fobrænding","EPDDanmark",true,1.7999999999999999E-2,"m³/m²",60,1]
[13,"Byggevare","WISA Gran krydsfiner, ubehandlet, Fobrænding","EPDDanmark",true,2.5000000000000001E-2,"m³/m²",60,1]
[14,"Byggevare","Solceller, Sunpower","User",true,1,"m²/m²",30,1]
[15,"Byggevare","Stål, valsede profiler og plader","GenDk",true,7,"kg/stk.",120,1]
[16,"Byggevare","Stål, valsede profiler og plader","GenDk",true,29,"kg/stk.",120,1]
[17,"Byggevare","Stål, valsede profiler og plader","GenDk",true,10,"kg/stk.",120,1]
[18,"Byggevare","Stål, valsede profiler og plader","GenDk",true,48,"kg/stk.",120,1]
[19,"Byggevare","Fastgørelsesmidler/skruer i galvaniseret stål","GenDk",true,8.6209999999999995E-2,"kg/m",100,1]
[20,"Byggevare","Limtræs-produkter af fyr og gran, Fobrænding","EPDDanmark",true,3.6999999999999998E-2,"m³/m",100,1]
[21,"Byggevare","Fastgørelsesmidler/skruer i galvaniseret stål","GenDk",true,8.6209999999999995E-2,"kg/m",100,1]
[22,"Byggevare","Limtræs-produkter af fyr og gran, Fobrænding","EPDDanmark",true,4.9209999999999997E-2,"m³/m",100,1]
[23,"Byggevare","Fermacell fiberplade 12,5 mm","User",true,1.2,"m²/m²",50,1]
[24,"Byggevare","Fermacell fiberplade 12,5 mm","User",true,1.2,"kg/m²",50,1]
[25,"Byggevare","Savede og tørrede konstruktionstræprodukter af fyr og gran, Fobrænding","EPDDanmark",true,1.0500000000000001E-2,"m³/m²",100,1]
[26,"Byggevare","Træfiberisolering (bats), kl. 38 - Hunton","User",true,5.9499999999999997E-2,"m³/m²",100,1]
[27,"Byggevare","Savede og tørrede konstruktionstræprodukter af fyr og gran, Fobrænding","EPDDanmark",true,1.0500000000000001E-2,"m³/m²",100,1]
[28,"Byggevare","Træfiberisolering (bats), kl. 38 - Hunton","User",true,5.9499999999999997E-2,"m³/m²",100,1]
[29,"Byggevare","WISA Gran krydsfiner, ubehandlet, Fobrænding","EPDDanmark",true,1.4999999999999999E-2,"m³/m²",30,1]
[30,"Byggevare","WISA Gran krydsfiner, ubehandlet, Fobrænding","EPDDanmark",true,1.4999999999999999E-2,"m³/m²",30,1]
[31,"Byggevare","Fermacell fiberplade 12,5 mm","User",true,1.2,"m²/m²",50,1]
[32,"Byggevare","Savede og tørrede konstruktionstræprodukter af fyr og gran, Fobrænding","EPDDanmark",true,1.0500000000000001E-2,"m³/m²",100,1]
[33,"Byggevare","Træfiberisolering (bats), kl. 38 - Hunton","User",true,5.9499999999999997E-2,"m³/m²",100,1]
[34,"Byggevare","WISA Gran krydsfiner, ubehandlet, Fobrænding","EPDDanmark",true,1.4999999999999999E-2,"m³/m²",30,1]
[35,"Byggevare","Fermacell fiberplade 12,5 mm","User",true,1.2,"m²/m²",60,1]
[36,"Byggevare","Keramikfliser, glaseret","GenDk",true,1,"m²/m²",80,1]
[37,"Byggevare","Mørtel, fliseklæber","GenDk",true,3.1,"kg/m²",80,1]
[38,"Byggevare","Savede og tørrede konstruktionstræprodukter af fyr og gran, Fobrænding","EPDDanmark",true,1.0500000000000001E-2,"m³/m²",100,1]
[39,"Byggevare","Træfiberisolering (bats), kl. 38 - Hunton","User",true,5.9499999999999997E-2,"m³/m²",100,1]
[40,"Byggevare","Vandtætningsmembran, flydende","GenDk",true,1.2,"kg/m²",50,1]
[41,"Byggevare","WISA Gran krydsfiner, ubehandlet, Fobrænding","EPDDanmark",true,1.4999999999999999E-2,"m³/m²",30,1]
[42,"Byggevare","Fermacell fiberplade 12,5 mm","User",true,1.2,"m²/m²",60,1]
[43,"Byggevare","Keramikfliser, glaseret","GenDk",true,1,"m²/m²",80,1]
[44,"Byggevare","Mørtel, fliseklæber","GenDk",true,3.1,"kg/m²",80,1]
[45,"Byggevare","Savede og tørrede konstruktionstræprodukter af fyr og gran, Fobrænding","EPDDanmark",true,1.6500000000000001E-2,"m³/m²",100,1]
[46,"Byggevare","Træfiberisolering (bats), kl. 38 - Hunton","User",true,9.35E-2,"m³/m²",100,1]
[47,"Byggevare","Vandtætningsmembran, flydende","GenDk",true,1.2,"kg/m²",50,1]
[48,"Byggevare","WISA Gran krydsfiner, ubehandlet, Fobrænding","EPDDanmark",true,1.4999999999999999E-2,"m³/m²",30,1]
[49,"Byggevare","Savede og tørrede konstruktionstræprodukter af fyr og gran, Fobrænding","EPDDanmark",true,5.0000000000000001E-3,"m³/m²",100,1]
[50,"Byggevare","WISA Gran krydsfiner, ubehandlet, Fobrænding","EPDDanmark",true,0.03,"m³/m²",30,1]
[51,"Byggevare","Savede og tørrede konstruktionstræprodukter af fyr og gran, Fobrænding","EPDDanmark",true,7.0000000000000001E-3,"m³/m²",100,1]
[52,"Byggevare","WISA Gran krydsfiner, ubehandlet, Fobrænding","EPDDanmark",true,1.4999999999999999E-2,"m³/m²",30,1]
[53,"Byggevare","Savede og tørrede konstruktionstræprodukter af fyr og gran, Fobrænding","EPDDanmark",true,7.4999999999999997E-3,"m³/m²",100,1]
[54,"Byggevare","Træfiberisolering (bats), kl. 38 - Hunton","User",true,4.2500000000000003E-2,"m³/m²",100,1]
[55,"Byggevare","WISA Gran krydsfiner, ubehandlet, Fobrænding","EPDDanmark",true,1.4999999999999999E-2,"m³/m²",30,1]
[56,"Byggevare","WISA Gran krydsfiner, ubehandlet, Fobrænding","EPDDanmark",true,1.4999999999999999E-2,"m³/m²",30,1]
[57,"Byggevare","Keramikfliser, glaseret","GenDk",true,1,"m²/m²",80,1]
[58,"Byggevare","Mørtel, fliseklæber","GenDk",true,3.2,"kg/m²",80,1]
[59,"Byggevare","Vandtætningsmembran, flydende","GenDk",true,1.2,"kg/m²",50,1]
[60,"Byggevare","Limtræs-produkter af fyr og gran, Fobrænding","EPDDanmark",true,5.1999999999999998E-2,"m³/stk.",120,1]
[61,"Byggevare","Asfaltimprægneret porøs træfiberplade, 18 mm - Hunton Undertag","User",true,1.39,"m²/m²",50,1]
[62,"Byggevare","Dampspærre PE (tykkelse 0,0002 m)","GenDk",true,1,"m²/m²",50,1]
[63,"Byggevare","Fermacell fiberplade 12,5 mm","User",true,2,"m²/m²",60,1]
[64,"Byggevare","Galvaniseret stålplade - Plannja","User",true,5.5,"kg/m²",50,1]
[65,"Byggevare","OSB-plade","GenDk",true,1.7999999999999999E-2,"m³/m²",120,1]
[66,"Byggevare","Papirisolering kl 37 - ISOCELL","User",true,13.6,"kg/m²",50,1]
[67,"Byggevare","Papirisolering kl 37 - ISOCELL","User",true,1.8,"kg/m²",50,1]
[68,"Byggevare","Savede og tørrede konstruktionstræprodukter af fyr og gran, Fobrænding","EPDDanmark",true,7.0000000000000001E-3,"m³/m²",120,1]
[69,"Byggevare","Savede og tørrede konstruktionstræprodukter af fyr og gran, Fobrænding","EPDDanmark",true,2E-3,"kg/m²",120,1]
[70,"Byggevare","Savede og tørrede konstruktionstræprodukter af fyr og gran, Fobrænding","EPDDanmark",true,8.0000000000000002E-3,"m³/m²",120,1]
[71,"Byggevare","Savede og tørrede konstruktionstræprodukter af fyr og gran, Fobrænding","EPDDanmark",true,4.3999999999999997E-2,"m³/m²",120,1]
[72,"Byggevare","Savede og tørrede konstruktionstræprodukter af fyr og gran, Fobrænding","EPDDanmark",true,7.0000000000000001E-3,"m³/m²",120,1]
[73,"Byggevare","Dampspærre PE (tykkelse 0,0002 m)","GenDk",true,1,"m²/m²",50,1]
[74,"Byggevare","Derbigum NT","EPDDanmark",true,1,"m²/m²",40,1]
[75,"Byggevare","Fermacell fiberplade 12,5 mm","User",true,2,"m²/m²",60,1]
[76,"Byggevare","Papirisolering kl 37 - ISOCELL","User",true,13.6,"kg/m²",50,1]
[77,"Byggevare","Papirisolering kl 37 - ISOCELL","User",true,1.8,"kg/m²",50,1]
[78,"Byggevare","Savede og tørrede konstruktionstræprodukter af fyr og gran, Fobrænding","EPDDanmark",true,1.0999999999999999E-2,"m³/m²",120,1]
[79,"Byggevare","Savede og tørrede konstruktionstræprodukter af fyr og gran, Fobrænding","EPDDanmark",true,1.0999999999999999E-2,"m³/m²",120,1]
[80,"Byggevare","Savede og tørrede konstruktionstræprodukter af fyr og gran, Fobrænding","EPDDanmark",true,4.3999999999999997E-2,"m³/m²",120,1]
[81,"Byggevare","Savede og tørrede konstruktionstræprodukter af fyr og gran, Fobrænding","EPDDanmark",true,7.0000000000000001E-3,"m³/m²",120,1]
[82,"Byggevare","WISA Gran krydsfiner, ubehandlet, Fobrænding","EPDDanmark",true,2.1000000000000001E-2,"m³/m²",120,1]
[83,"Byggevare","WISA Gran krydsfiner, ubehandlet, Fobrænding","EPDDanmark",true,2.1000000000000001E-2,"m³/m²",120,1]
[84,"Byggevare","Afretningslag, cementbaseret","GenDk",true,120,"kg/m²",80,1]
[85,"Byggevare","EPS isolering til lofter / gulve og kælderydervæg / terrændæk 040","GenDk",true,3.0000000000000001E-3,"m³/m²",80,1]
[86,"Byggevare","Keramikfliser, glaseret","GenDk",true,1,"m²/m²",100,1]
[87,"Byggevare","Mørtel, fliseklæber","GenDk",true,3.1,"kg/m²",100,1]
[88,"Byggevare","Vandtætningsmembran, flydende","GenDk",true,1.2,"kg/m²",80,1]
[89,"Byggevare","Cembrit Windstopper Extreme, 9 mm","User",true,1,"m²/m²",50,1]
[90,"Byggevare","Dampspærre PE (tykkelse 0,0002 m)","GenDk",true,1,"m²/m²",80,1]
[91,"Byggevare","Papirisolering kl 37 - ISOCELL","User",true,14.3,"kg/m²",50,1]
[92,"Byggevare","Savede og tørrede konstruktionstræprodukter af fyr og gran, Fobrænding","EPDDanmark",true,5.5E-2,"m³/m²",100,1]
[93,"Byggevare","Spaandex spånplader, Spaandex spånplader (DK)","EPDDanmark",true,13.2,"kg/m²",100,1]
[94,"Byggevare","Trinlydsdug - Scan Underlay","User",true,1,"m²/m²",80,1]
[95,"Byggevare","Trægulv 14 mm ask - Tarkett Sverige","User",true,1,"m²/m²",80,1]
[96,"Byggevare","Savede og tørrede konstruktionstræprodukter af fyr og gran, Fobrænding","EPDDanmark",true,80,"kg/stk.",100,1]
[97,"Byggevare","Trægulv 14 mm ask - Tarkett Sverige","User",true,4.5,"m²/stk.",60,1]
[98,"Byggevare","WISA Gran krydsfiner, ubehandlet, Fobrænding","EPDDanmark",true,4.4999999999999998E-2,"m³/stk.",100,1]
[99,"Byggevare","Brugsvandsrør, rustfri stål","GenDk",true,1.3,"kg/m",60,1]
[100,"Byggevare","Buffertank, rustfri stål","GenDk",true,220,"kg/stk.",30,1]
[101,"Byggevare","Magna3 25-(40/60/80/100/120)","User",true,1,"stk./stk.",30,1]
[102,"Byggevare","Panel radiator 500mm x 700mm - Lyngson","User",true,0.81142857099999999,"stk./stk.",40,1]
[103,"Byggevare","Panel radiator 500mm x 700mm - Lyngson","User",true,0.571428571,"stk./stk.",40,1]
[104,"Byggevare","Panel radiator 500mm x 700mm - Lyngson","User",true,0.62857142899999996,"stk./stk.",40,1]
[105,"Byggevare","Panel radiator 500mm x 700mm - Lyngson","User",true,1.1428571430000001,"stk./stk.",40,1]
[106,"Byggevare","Panel radiator 500mm x 700mm - Lyngson","User",true,0.34285714299999998,"stk./stk.",40,1]
[107,"Byggevare","Panel radiator 500mm x 700mm - Lyngson","User",true,0.34285714299999998,"stk./stk.",40,1]
[108,"Byggevare","Panel radiator 500mm x 700mm - Lyngson","User",true,1.542857143,"stk./stk.",40,1]
[109,"Byggevare","Varmepumpe (luft-vand) 10 kW","GenDk",true,0.62,"stk./stk.",30,1]
[110,"Byggevare","Brugsvandsrør, rustfri stål","GenDk",true,1.2585500000000001,"kg/m",80,1]
[111,"Byggevare","Ventilationskanal, galvaniseret stål","GenDk",true,1.5249999999999999,"kg/m",50,1]
[112,"Byggevare","Fastgørelsesmidler/skruer i galvaniseret stål","GenDk",true,1,"kg/stk.",50,1]
[113,"Byggevare","Overflade, Indendørsmaling, emulsions maling, slidstærk","GenDk",true,0.35749999999999998,"kg/stk.",50,1]
[114,"Byggevare","Spånplade","GenDk",true,33,"kg/stk.",50,1]
[115,"Byggevare","Træ, fyrretræ (12% fugt / 10,7% H2O)","GenDk",true,10,"kg/stk.",50,1]
[116,"Byggevare","Grå støbejern","GenDk",true,0.05,"kg/m²",60,1]
[117,"Byggevare","Høvlede konstruktionstræsprodukter af fyr og gran, Fobrænding","EPDDanmark",true,1.63,"kg/m²",60,1]
[118,"Byggevare","Savede og tørrede konstruktionstræprodukter af fyr og gran, Fobrænding","EPDDanmark",true,22.53,"kg/m²",40,1]
[119,"Byggevare","3-lags-rude","GenDk",true,0.85,"m²/m²",25,1]
[120,"Byggevare","Trævindue med 3-lags rude","EPDDanmark",true,1,"m²/m²",50,1]
[121,"Byggevare","3-lags-rude","GenDk",true,0.85,"m²/m²",25,1]
[122,"Byggevare","Velux GGL ovenlys m. aluinddækning, 3-lagsrude (træ)","User",true,1,"m²/m²",50,1]
[123,"Byggevare","3-lags-rude","GenDk",true,0.85,"m²/m²",25,1]
[124,"Byggevare","Velux modular skylight, 3-lagsrude","User",true,1,"m²/m²",50,1]
[125,"Byggevare","Cembrit Windstopper Extreme, 9 mm","User",true,1,"m²/m²",80,1]
[126,"Byggevare","Dampspærre PE (tykkelse 0,0002 m)","GenDk",true,1,"m²/m²",80,1]
[127,"Byggevare","Fermacell fiberplade 12,5 mm","User",true,2,"m²/m²",50,1]
[128,"Byggevare","OSB-plade","GenDk",true,1.7999999999999999E-2,"m³/m²",120,1]
[129,"Byggevare","Papirisolering kl 37 - ISOCELL","User",true,12.5,"kg/m²",60,1]
[130,"Byggevare","Papirisolering kl 37 - ISOCELL","User",true,1.91,"kg/m²",60,1]
[131,"Byggevare","Savede og tørrede konstruktionstræprodukter af fyr og gran, Fobrænding","EPDDanmark",true,4.3999999999999997E-2,"m³/m²",120,1]
[132,"Byggevare","Savede og tørrede konstruktionstræprodukter af fyr og gran, Fobrænding","EPDDanmark",true,7.0000000000000001E-3,"m³/m²",120,1]
[133,"Byggevare","Cembrit Windstopper Extreme, 9 mm","User",true,1,"m²/m²",80,1]
[134,"Byggevare","Dampspærre PE (tykkelse 0,0002 m)","GenDk",true,1,"m²/m²",80,1]
[135,"Byggevare","Fermacell fiberplade 12,5 mm","User",true,2,"m²/m²",50,1]
[136,"Byggevare","OSB-plade","GenDk",true,1.7999999999999999E-2,"m³/m²",120,1]
[137,"Byggevare","Papirisolering kl 37 - ISOCELL","User",true,8.3000000000000007,"kg/m²",60,1]
[138,"Byggevare","Papirisolering kl 37 - ISOCELL","User",true,1.91,"kg/m²",60,1]
[139,"Byggevare","Savede og tørrede konstruktionstræprodukter af fyr og gran, Fobrænding","EPDDanmark",true,2.9000000000000001E-2,"m³/m²",120,1]
[140,"Byggevare","Savede og tørrede konstruktionstræprodukter af fyr og gran, Fobrænding","EPDDanmark",true,7.0000000000000001E-3,"m³/m²",120,1]
[141,"Byggevare","Savede og tørrede konstruktionstræprodukter af fyr og gran, Fobrænding","EPDDanmark",true,2E-3,"m³/m²",120,1]
[142,"Byggevare","Savede og tørrede konstruktionstræprodukter af fyr og gran, Fobrænding","EPDDanmark",true,4.0000000000000001E-3,"m³/m²",120,1]
[143,"Byggevare","Træbeklædning 19 mm, ubehandlet gran - InnTre Kjeldstad AS","User",true,1.105,"m²/m²",25,1]
[144,"Byggevare","Savede og tørrede konstruktionstræprodukter af fyr og gran, Fobrænding","EPDDanmark",true,2E-3,"m³/m²",120,1]
[145,"Byggevare","Savede og tørrede konstruktionstræprodukter af fyr og gran, Fobrænding","EPDDanmark",true,4.0000000000000001E-3,"m³/m²",120,1]
[146,"Byggevare","Træbeklædning 19 mm, ubehandlet gran - InnTre Kjeldstad AS","User",true,1.105,"m²/m²",25,1]

{"sheet":"Resultater","index":6,"n_rows":147,"n_cols":19,"rows_kept":147,"cut":false,"hidden":true,"merged":[]}
["Indeks","Gruppe","Undergruppe","Bygningsdel","Konstruktion","Byggevare","Udskiftninger ","GWP ex_c3","GWP ex_c4","GWP ex_d","GWP a1_3","GWP a4","GWP a5","GWP b4","GWP b6","GWP c3","GWP c4","GWP d","GWP sum"]
[1,"Afløb","Faldstammer","Afløbsrør","Afløbsrør, PP","Rør, Kloakrør PP",0,0,0,0,98.244,0,0,0,0,129.54150000000001,0,-63.959625000000003,227.78550000000001]
[2,"Afløb","Nedløb fra tag","Tagrende","Nedløbsrør ","Stål, valsede profiler og plader",0,0,0,0,8.4375,0,0,0,0,1.383E-2,0,-3.1004999999999998,8.4513300000000005]
[3,"Afløb","Nedløb fra tag","Tagrende","Tagrende","Stål, valsede profiler og plader",0,0,0,0,26.915624999999999,0,0,0,0,4.4117700000000003E-2,0,-9.8905949999999994,26.9597427]
[4,"Dæk","Etagedæk","Etagedæk, bjælkelag","Etagedæk 1. sal, 270 mm bjælkelag","Fastgørelsesmidler/skruer i galvaniseret stål",0,0,0,0,42.766770299999997,0,0,0,0,0,8.205302099999999E-3,-21.7817586,42.7749756021]
[5,"Dæk","Etagedæk","Etagedæk, bjælkelag","Etagedæk 1. sal, 270 mm bjælkelag","Savede og tørrede konstruktionstræprodukter af fyr og gran, Fobrænding",0,0,0,0,-927.11200000000008,0,0,0,0,992.55520000000001,0,-505.82139999999998,65.443199999999933]
[6,"Dæk","Etagedæk","Etagedæk, bjælkelag","Etagedæk 1. sal, 270 mm bjælkelag","Savede og tørrede konstruktionstræprodukter af fyr og gran, Fobrænding",0,0,0,0,-654.43200000000002,0,0,0,0,700.6271999999999,0,-357.05040000000002,46.195199999999893]
[7,"Dæk","Etagedæk","Etagedæk, bjælkelag","Etagedæk 2. sal, 230 mm bjælkelag","Fastgørelsesmidler/skruer i galvaniseret stål",0,0,0,0,70.389197999999993,0,0,0,0,0,1.3504986E-2,-35.850276000000001,70.402702985999994]
[8,"Dæk","Etagedæk","Etagedæk, bjælkelag","Etagedæk 2. sal, 230 mm bjælkelag","Savede og tørrede konstruktionstræprodukter af fyr og gran, Fobrænding",0,0,0,0,-1974.72,0,0,0,0,2114.1120000000001,0,-1077.384,139.3919999999996]
[9,"Dæk","Etagedæk","Etagedæk, bjælkelag","Etagedæk, 70 mm gulvopbygning","Fermacell fiberplade 12,5 mm",0,0,0,0,75.239999999999995,0,0,0,0,0,13.2799029,0,88.519902899999991]
[10,"Dæk","Etagedæk","Etagedæk, bjælkelag","Etagedæk, 70 mm gulvopbygning","Trinlydsdug - Scan Underlay",0,0,0,0,33.725999999999999,0,0,0,0,0,0.94534901999999998,0,34.671349020000001]
[11,"Dæk","Etagedæk","Etagedæk, bjælkelag","Etagedæk, 70 mm gulvopbygning","Trægulv 14 mm ask - Tarkett Sverige",0,0,0,0,-494.34,0,0,0,0,0,798.5999999999998,0,304.25999999999982]
[12,"Dæk","Etagedæk","Etagedæk, bjælkelag","Etagedæk, 70 mm gulvopbygning","WISA Gran krydsfiner, ubehandlet, Fobrænding",0,0,0,0,-711.61199999999997,0,0,0,0,882.68399999999997,0,-464.50799999999998,171.072]
[13,"Dæk","Etagedæk","Etagedæk, bjælkelag","Etagedæk, 70 mm gulvopbygning","WISA Gran krydsfiner, ubehandlet, Fobrænding",0,0,0,0,-988.35000000000014,0,0,0,0,1225.95,0,-645.15000000000009,237.59999999999991]
[14,"El- og mekaniske anlæg","Energiproduktion","Solceller","Solceller, Sunpower","Solceller, Sunpower",1,0,0,0,818.32,0,0,819.70276999999999,0,1.3673999999999999,1.537E-2,-661.43999999999994,1639.40554]
[15,"Fundamenter","Punktfundament","Skruefundament","Krinner V114x5-M24","Stål, valsede profiler og plader",0,0,0,0,126,0,0,0,0,0.20652799999999999,0,-46.300800000000002,126.20652800000001]
[16,"Fundamenter","Punktfundament","Skruefundament","Krinner V114x5x2000","Stål, valsede profiler og plader",0,0,0,0,522,0,0,0,0,0.85561600000000004,0,-191.8176,522.85561600000005]
[17,"Fundamenter","Punktfundament","Skruefundament","Krinner V140x6,3-M24","Stål, valsede profiler og plader",0,0,0,0,33.75,0,0,0,0,5.5320000000000008E-2,0,-12.401999999999999,33.805320000000002]
[18,"Fundamenter","Punktfundament","Skruefundament","Krinner V140x6,3x2000 ","Stål, valsede profiler og plader",0,0,0,0,162,0,0,0,0,0.26553599999999999,0,-59.529600000000002,162.265536]
[19,"Fundamenter","Punktfundament","Skruefundament","Rem 200x185, limtræ","Fastgørelsesmidler/skruer i galvaniseret stål",0,0,0,0,4.9036385935999993,0,0,0,0,0,9.4082007519999996E-4,-2.4974968031999998,4.904579413675199]
[20,"Fundamenter","Punktfundament","Skruefundament","Rem 200x185, limtræ","Limtræs-produkter af fyr og gran, Fobrænding",0,0,0,0,-361.12,0,0,0,0,439.85599999999999,0,-233.84,78.73599999999999]
[21,"Fundamenter","Punktfundament","Skruefundament","Rem 266x185, limtræ","Fastgørelsesmidler/skruer i galvaniseret stål",0,0,0,0,4.9036385935999993,0,0,0,0,0,9.4082007519999996E-4,-2.4974968031999998,4.904579413675199]
[22,"Fundamenter","Punktfundament","Skruefundament","Rem 266x185, limtræ","Limtræs-produkter af fyr og gran, Fobrænding",0,0,0,0,-480.28960000000001,0,0,0,0,585.00847999999996,0,-311.00720000000001,104.71888]
[23,"Indervægge","Bærende indervægge","Indervægge","100 mm indervæg, fibergips","Fermacell fiberplade 12,5 mm",0,0,0,0,34.200000000000003,0,0,0,0,0,6.0363195000000003,0,40.236319499999993]
[24,"Indervægge","Bærende indervægge","Indervægge","100 mm indervæg, fibergips","Fermacell fiberplade 12,5 mm",0,0,0,0,2.31864406779661,0,0,0,0,0,0.40924199999999999,0,2.7278860677966099]
[25,"Indervægge","Bærende indervægge","Indervægge","100 mm indervæg, fibergips","Savede og tørrede konstruktionstræprodukter af fyr og gran, Fobrænding",0,0,0,0,-178.5,0,0,0,0,191.1,0,-97.387500000000003,12.599999999999991]
[26,"Indervægge","Bærende indervægge","Indervægge","100 mm indervæg, fibergips","Træfiberisolering (bats), kl. 38 - Hunton",0,0,0,0,-93.117499999999993,0,0,0,0,114.68625,9.743125E-3,-7.9134999999999991,21.57849312499998]
[27,"Indervægge","Bærende indervægge","Indervægge","100 mm indervæg, krydsfiner","Savede og tørrede konstruktionstræprodukter af fyr og gran, Fobrænding",0,0,0,0,-264.18,0,0,0,0,282.82799999999997,0,-144.1335,18.648000000000021]
[28,"Indervægge","Bærende indervægge","Indervægge","100 mm indervæg, krydsfiner","Træfiberisolering (bats), kl. 38 - Hunton",0,0,0,0,-137.81389999999999,0,0,0,0,169.73564999999999,1.4419825000000001E-2,-11.711980000000001,31.936169824999979]
[29,"Indervægge","Bærende indervægge","Indervægge","100 mm indervæg, krydsfiner","WISA Gran krydsfiner, ubehandlet, Fobrænding",1,0,0,0,-332.44499999999988,0,0,79.920000000000016,0,412.36500000000001,0,-434.00999999999988,159.84]
[30,"Indervægge","Bærende indervægge","Indervægge","100 mm indervæg, krydsfiner","WISA Gran krydsfiner, ubehandlet, Fobrænding",1,0,0,0,-332.44499999999988,0,0,79.920000000000016,0,412.36500000000001,0,-434.00999999999988,159.84]
[31,"Indervægge","Bærende indervægge","Indervægge","100 mm indervæg, krydsfiner og fibergips","Fermacell fiberplade 12,5 mm",0,0,0,0,6.84,0,0,0,0,0,1.2072639000000001,0,8.0472639000000008]
[32,"Indervægge","Bærende indervægge","Indervægge","100 mm indervæg, krydsfiner og fibergips","Savede og tørrede konstruktionstræprodukter af fyr og gran, Fobrænding",0,0,0,0,-35.700000000000003,0,0,0,0,38.22,0,-19.477499999999999,2.519999999999996]
[33,"Indervægge","Bærende indervægge","Indervægge","100 mm indervæg, krydsfiner og fibergips","Træfiberisolering (bats), kl. 38 - Hunton",0,0,0,0,-18.6235,0,0,0,0,22.937249999999999,1.9486250000000001E-3,-1.5827,4.3156986249999987]
[34,"Indervægge","Bærende indervægge","Indervægge","100 mm indervæg, krydsfiner og fibergips","WISA Gran krydsfiner, ubehandlet, Fobrænding",1,0,0,0,-44.924999999999997,0,0,10.8,0,55.725000000000001,0,-58.65,21.600000000000009]
[35,"Indervægge","Bærende indervægge","Indervægge","110 mm indervæg mod bad, krydsfiner og fibergips med klinker ","Fermacell fiberplade 12,5 mm",0,0,0,0,8.2079999999999984,0,0,0,0,0,1.44871668,0,9.6567166799999988]
[36,"Indervægge","Bærende indervægge","Indervægge","110 mm indervæg mod bad, krydsfiner og fibergips med klinker ","Keramikfliser, glaseret",0,0,0,0,37.078139999999998,0,0,0,0,0.88046400000000014,0,-0.24647759999999999,37.958604000000001]
[37,"Indervægge","Bærende indervægge","Indervægge","110 mm indervæg mod bad, krydsfiner og fibergips med klinker ","Mørtel, fliseklæber",0,0,0,0,6.4547952000000004,0,0,0,0,0,0.30447642000000003,-5.3107650000000013E-2,6.7592716200000007]
[38,"Indervægge","Bærende indervægge","Indervægge","110 mm indervæg mod bad, krydsfiner og fibergips med klinker ","Savede og tørrede konstruktionstræprodukter af fyr og gran, Fobrænding",0,0,0,0,-42.84,0,0,0,0,45.863999999999997,0,-23.373000000000001,3.0239999999999938]
[39,"Indervægge","Bærende indervægge","Indervægge","110 mm indervæg mod bad, krydsfiner og fibergips med klinker ","Træfiberisolering (bats), kl. 38 - Hunton",0,0,0,0,-22.348199999999999,0,0,0,0,27.524699999999999,2.3383499999999999E-3,-1.89924,5.1788383499999968]
[40,"Indervægge","Bærende indervægge","Indervægge","110 mm indervæg mod bad, krydsfiner og fibergips med klinker ","Vandtætningsmembran, flydende",0,0,0,0,7.992,0,0,0,0,1.9173599999999999E-2,0,0,8.0111735999999993]
[41,"Indervægge","Bærende indervægge","Indervægge","110 mm indervæg mod bad, krydsfiner og fibergips med klinker ","WISA Gran krydsfiner, ubehandlet, Fobrænding",1,0,0,0,-53.91,0,0,12.96000000000001,0,66.87,0,-70.38,25.920000000000019]
[42,"Indervægge","Bærende indervægge","Indervægge","150 mm indervæg mod bad, krydsfiner og fibergips med klinker","Fermacell fiberplade 12,5 mm",0,0,0,0,8.2079999999999984,0,0,0,0,0,1.44871668,0,9.6567166799999988]
[43,"Indervægge","Bærende indervægge","Indervægge","150 mm indervæg mod bad, krydsfiner og fibergips med klinker","Keramikfliser, glaseret",0,0,0,0,37.078139999999998,0,0,0,0,0.88046400000000014,0,-0.24647759999999999,37.958604000000001]
[44,"Indervægge","Bærende indervægge","Indervægge","150 mm indervæg mod bad, krydsfiner og fibergips med klinker","Mørtel, fliseklæber",0,0,0,0,6.4547952000000004,0,0,0,0,0,0.30447642000000003,-5.3107650000000013E-2,6.7592716200000007]
[45,"Indervægge","Bærende indervægge","Indervægge","150 mm indervæg mod bad, krydsfiner og fibergips med klinker","Savede og tørrede konstruktionstræprodukter af fyr og gran, Fobrænding",0,0,0,0,-67.320000000000007,0,0,0,0,72.072000000000003,0,-36.728999999999999,4.7519999999999953]
[46,"Indervægge","Bærende indervægge","Indervægge","150 mm indervæg mod bad, krydsfiner og fibergips med klinker","Træfiberisolering (bats), kl. 38 - Hunton",0,0,0,0,-35.118600000000001,0,0,0,0,43.253099999999989,3.67455E-3,-2.9845199999999998,8.138174549999988]
[47,"Indervægge","Bærende indervægge","Indervægge","150 mm indervæg mod bad, krydsfiner og fibergips med klinker","Vandtætningsmembran, flydende",0,0,0,0,7.992,0,0,0,0,1.9173599999999999E-2,0,0,8.0111735999999993]
[48,"Indervægge","Bærende indervægge","Indervægge","150 mm indervæg mod bad, krydsfiner og fibergips med klinker","WISA Gran krydsfiner, ubehandlet, Fobrænding",1,0,0,0,-53.91,0,0,12.96000000000001,0,66.87,0,-70.38,25.920000000000019]
[49,"Indervægge","Bærende indervægge","Indervægge","45 mm indervæg mod skakt, krydsfiner","Savede og tørrede konstruktionstræprodukter af fyr og gran, Fobrænding",0,0,0,0,-74.8,0,0,0,0,80.08,0,-40.81,5.2800000000000011]
[50,"Indervægge","Bærende indervægge","Indervægge","45 mm indervæg mod skakt, krydsfiner","WISA Gran krydsfiner, ubehandlet, Fobrænding",1,0,0,0,-395.34,0,0,95.039999999999964,0,490.37999999999988,0,-516.11999999999989,190.0799999999999]
[51,"Indervægge","Bærende indervægge","Indervægge","60 mm skunkvægge, krydsfiner","Savede og tørrede konstruktionstræprodukter af fyr og gran, Fobrænding",0,0,0,0,-95.2,0,0,0,0,101.92,0,-51.94,6.7200000000000131]
[52,"Indervægge","Bærende indervægge","Indervægge","60 mm skunkvægge, krydsfiner","WISA Gran krydsfiner, ubehandlet, Fobrænding",1,0,0,0,-179.7,0,0,43.200000000000017,0,222.9,0,-234.6,86.400000000000034]
[53,"Indervægge","Bærende indervægge","Indervægge","80 mm indervæg, krydsfiner","Savede og tørrede konstruktionstræprodukter af fyr og gran, Fobrænding",0,0,0,0,-15.3,0,0,0,0,16.38,0,-8.3475000000000001,1.08]
[54,"Indervægge","Bærende indervægge","Indervægge","80 mm indervæg, krydsfiner","Træfiberisolering (bats), kl. 38 - Hunton",0,0,0,0,-7.9814999999999996,0,0,0,0,9.8302499999999995,8.3512500000000004E-4,-0.67830000000000001,1.8495851249999991]
[55,"Indervægge","Bærende indervægge","Indervægge","80 mm indervæg, krydsfiner","WISA Gran krydsfiner, ubehandlet, Fobrænding",1,0,0,0,-26.954999999999998,0,0,6.480000000000004,0,33.435000000000002,0,-35.19,12.96000000000001]
[56,"Indervægge","Bærende indervægge","Indervægge","80 mm indervæg, krydsfiner","WISA Gran krydsfiner, ubehandlet, Fobrænding",1,0,0,0,-26.954999999999998,0,0,6.480000000000004,0,33.435000000000002,0,-35.19,12.96000000000001]
[57,"Indervægge","Bærende indervægge","Indervægge","Klinkebeklædning på badeværelse","Keramikfliser, glaseret",0,0,0,0,80.335970000000003,0,0,0,0,1.907672,0,-0.53403480000000003,82.243642000000008]
[58,"Indervægge","Bærende indervægge","Indervægge","Klinkebeklædning på badeværelse","Mørtel, fliseklæber",0,0,0,0,14.436531199999999,0,0,0,0,0,0.68097952000000006,-0.11877840000000001,15.11751072]
[59,"Indervægge","Bærende indervægge","Indervægge","Klinkebeklædning på badeværelse","Vandtætningsmembran, flydende",0,0,0,0,17.315999999999999,0,0,0,0,4.1542799999999998E-2,0,0,17.357542800000001]
[60,"Søjler og bjælker","Søjler","Træsøjle","Limtræssøjle 140 x 140 mm","Limtræs-produkter af fyr og gran, Fobrænding",0,0,0,0,-63.44,0,0,0,0,77.272000000000006,0,-41.080000000000013,13.83200000000001]
[61,"Tage","Tage","Tag, trækassette","Tagkassette, ståltag","Asfaltimprægneret porøs træfiberplade, 18 mm - Hunton Undertag",0,0,0,0,-800.76510000000007,0,0,0,0,1421.0109,0.19286249999999999,-22.0202688,620.43866249999996]
[62,"Tage","Tage","Tag, trækassette","Tagkassette, ståltag","Dampspærre PE (tykkelse 0,0002 m)",0,0,0,0,44.333843999999999,0,0,0,0,61.710561000000013,0,-30.465281999999998,106.044405]
[63,"Tage","Tage","Tag, trækassette","Tagkassette, ståltag","Fermacell fiberplade 12,5 mm",0,0,0,0,253.08,0,0,0,0,0,44.668764299999999,0,297.7487643]
[64,"Tage","Tage","Tag, trækassette","Tagkassette, ståltag","Galvaniseret stålplade - Plannja",0,0,0,0,1587.3,0,0,0,0,1.4835149999999999,0.47680050000000002,-860.80499999999995,1589.2603154999999]
[65,"Tage","Tage","Tag, trækassette","Tagkassette, ståltag","OSB-plade",0,0,0,0,-1144.266588,0,0,0,0,2160.0338040000001,0,-627.21096119999993,1015.767216]
[66,"Tage","Tage","Tag, trækassette","Tagkassette, ståltag","Papirisolering kl 37 - ISOCELL",0,0,0,0,-1856.808,0,0,0,0,2188.92,0,-674.7912,332.11199999999991]
[67,"Tage","Tage","Tag, trækassette","Tagkassette, ståltag","Papirisolering kl 37 - ISOCELL",0,0,0,0,-245.75399999999999,0,0,0,0,289.70999999999998,0,-89.310600000000008,43.95599999999996]
[68,"Tage","Tage","Tag, trækassette","Tagkassette, ståltag","Savede og tørrede konstruktionstræprodukter af fyr og gran, Fobrænding",0,0,0,0,-528.36,0,0,0,0,565.65600000000006,0,-288.267,37.296000000000049]
[69,"Tage","Tage","Tag, trækassette","Tagkassette, ståltag","Savede og tørrede konstruktionstræprodukter af fyr og gran, Fobrænding",0,0,0,0,-0.33105263157894732,0,0,0,0,0.35442105263157891,0,-0.18061842105263151,2.3368421052631538E-2]
[70,"Tage","Tage","Tag, trækassette","Tagkassette, ståltag","Savede og tørrede konstruktionstræprodukter af fyr og gran, Fobrænding",0,0,0,0,-603.84,0,0,0,0,646.46399999999994,0,-329.44799999999998,42.62399999999991]
[71,"Tage","Tage","Tag, trækassette","Tagkassette, ståltag","Savede og tørrede konstruktionstræprodukter af fyr og gran, Fobrænding",0,0,0,0,-3321.119999999999,0,0,0,0,3555.5520000000001,0,-1811.9639999999999,234.43200000000019]
[72,"Tage","Tage","Tag, trækassette","Tagkassette, ståltag","Savede og tørrede konstruktionstræprodukter af fyr og gran, Fobrænding",0,0,0,0,-528.36,0,0,0,0,565.65600000000006,0,-288.267,37.296000000000049]
[73,"Tage","Tage","Tag, trækassette","Tagkassette, tagpap","Dampspærre PE (tykkelse 0,0002 m)",0,0,0,0,5.9910600000000001,0,0,0,0,8.3392649999999993,0,-4.11693,14.330325]
[74,"Tage","Tage","Tag, trækassette","Tagkassette, tagpap","Derbigum NT",1,0,0,0,46.8,0,0,51.481515000000002,0,4.68,1.5150000000000001E-3,-13.29,102.96303]
[75,"Tage","Tage","Tag, trækassette","Tagkassette, tagpap","Fermacell fiberplade 12,5 mm",0,0,0,0,34.200000000000003,0,0,0,0,0,6.0363195000000003,0,40.236319499999993]
[76,"Tage","Tage","Tag, trækassette","Tagkassette, tagpap","Papirisolering kl 37 - ISOCELL",0,0,0,0,-250.92,0,0,0,0,295.8,0,-91.188000000000002,44.880000000000017]
[77,"Tage","Tage","Tag, trækassette","Tagkassette, tagpap","Papirisolering kl 37 - ISOCELL",0,0,0,0,-33.21,0,0,0,0,39.15,0,-12.069000000000001,5.9399999999999977]
[78,"Tage","Tage","Tag, trækassette","Tagkassette, tagpap","Savede og tørrede konstruktionstræprodukter af fyr og gran, Fobrænding",0,0,0,0,-112.2,0,0,0,0,120.12,0,-61.214999999999989,7.9200000000000017]
[79,"Tage","Tage","Tag, trækassette","Tagkassette, tagpap","Savede og tørrede konstruktionstræprodukter af fyr og gran, Fobrænding",0,0,0,0,-112.2,0,0,0,0,120.12,0,-61.214999999999989,7.9200000000000017]
[80,"Tage","Tage","Tag, trækassette","Tagkassette, tagpap","Savede og tørrede konstruktionstræprodukter af fyr og gran, Fobrænding",0,0,0,0,-448.8,0,0,0,0,480.48,0,-244.86,31.68000000000001]
[81,"Tage","Tage","Tag, trækassette","Tagkassette, tagpap","Savede og tørrede konstruktionstræprodukter af fyr og gran, Fobrænding",0,0,0,0,-71.399999999999991,0,0,0,0,76.439999999999984,0,-38.954999999999991,5.039999999999992]
[82,"Tage","Tage","Tag, trækassette","Tagkassette, tagpap","WISA Gran krydsfiner, ubehandlet, Fobrænding",0,0,0,0,-188.685,0,0,0,0,234.04499999999999,0,-123.16500000000001,45.359999999999957]
[83,"Tage","Tage","Tag, trækassette","Tagkassette, tagpap","WISA Gran krydsfiner, ubehandlet, Fobrænding",0,0,0,0,-188.685,0,0,0,0,234.04499999999999,0,-123.16500000000001,45.359999999999957]
[84,"Terrændæk","Terrændæk","Terrændæk, trækassette","Gulv, vådrumsgulv, keramiske fliser","Afretningslag, cementbaseret",0,0,0,0,110.1306,0,0,0,0,0,9.0032999999999994,0,119.1339]
[85,"Terrændæk","Terrændæk","Terrændæk, trækassette","Gulv, vådrumsgulv, keramiske fliser","EPS isolering til lofter / gulve og kælderydervæg / terrændæk 040",0,0,0,0,0.80699999999999994,0,0,0,0,0,0.91499999999999992,-0.48149999999999998,1.722]
[86,"Terrændæk","Terrændæk","Terrændæk, trækassette","Gulv, vådrumsgulv, keramiske fliser","Keramikfliser, glaseret",0,0,0,0,30.89845,0,0,0,0,0.73372000000000004,0,-0.205398,31.632169999999999]
[87,"Terrændæk","Terrændæk","Terrændæk, trækassette","Gulv, vådrumsgulv, keramiske fliser","Mørtel, fliseklæber",0,0,0,0,5.3789959999999999,0,0,0,0,0,0.25373034999999999,-4.4256375000000001E-2,5.6327263500000004]
[88,"Terrændæk","Terrændæk","Terrændæk, trækassette","Gulv, vådrumsgulv, keramiske fliser","Vandtætningsmembran, flydende",0,0,0,0,6.66,0,0,0,0,1.5977999999999999E-2,0,0,6.6759779999999997]
[89,"Terrændæk","Terrændæk","Terrændæk, trækassette","Let trækassette, terræn","Cembrit Windstopper Extreme, 9 mm",0,0,0,0,514.64,0,0,0,0,0,10.416,0,525.05600000000004]
[90,"Terrændæk","Terrændæk","Terrændæk, trækassette","Let trækassette, terræn","Dampspærre PE (tykkelse 0,0002 m)",0,0,0,0,22.366624000000002,0,0,0,0,31.133255999999999,0,-15.369872000000001,53.499879999999997]
[91,"Terrændæk","Terrændæk","Terrændæk, trækassette","Let trækassette, terræn","Papirisolering kl 37 - ISOCELL",0,0,0,0,-984.98400000000004,0,0,0,0,1161.1600000000001,0,-357.95760000000001,176.17599999999999]
[92,"Terrændæk","Terrændæk","Terrændæk, trækassette","Let trækassette, terræn","Savede og tørrede konstruktionstræprodukter af fyr og gran, Fobrænding",0,0,0,0,-2094.4,0,0,0,0,2242.2399999999998,0,-1142.68,147.84000000000009]
[93,"Terrændæk","Terrændæk","Terrændæk, trækassette","Let trækassette, terræn","Spaandex spånplader, Spaandex spånplader (DK)",0,0,0,0,-1005.312,0,0,0,0,1227.0719999999999,0,-680.80319999999995,221.75999999999991]
[94,"Terrændæk","Terrændæk","Terrændæk, trækassette","Trægulv terrændæk","Trinlydsdug - Scan Underlay",0,0,0,0,23.506,0,0,0,0,0,0.65887962,0,24.164879620000001]
[95,"Terrændæk","Terrændæk","Terrændæk, trækassette","Trægulv terrændæk","Trægulv 14 mm ask - Tarkett Sverige",0,0,0,0,-344.54,0,0,0,0,0,556.6,0,212.06]
[96,"Trapper og ramper","Trapper og ramper","Trappe","Trætrappe pr. etage","Savede og tørrede konstruktionstræprodukter af fyr og gran, Fobrænding",0,0,0,0,-238.59649122807019,0,0,0,0,255.43859649122811,0,-130.1754385964912,16.84210526315789]
[97,"Trapper og ramper","Trapper og ramper","Trappe","Trætrappe pr. etage","Trægulv 14 mm ask - Tarkett Sverige",0,0,0,0,-67.41,0,0,0,0,0,108.9,0,41.489999999999988]
[98,"Trapper og ramper","Trapper og ramper","Trappe","Trætrappe pr. etage","WISA Gran krydsfiner, ubehandlet, Fobrænding",0,0,0,0,-53.91,0,0,0,0,66.87,0,-35.19,12.96000000000001]
[99,"Vand","Vandrør","Vandrør","Rustfrit stålrør","Brugsvandsrør, rustfri stål",0,0,0,0,138.80958000000001,0,0,0,0,0,2.660073E-2,-103.88703,138.83618073]
[100,"Vand","Varmtvandsbeholder","VVB og buffertank","Metroair 330, indedel til VP","Buffertank, rustfri stål",1,0,0,0,892.82819999999992,0,0,1038.7861,0,145.9579,0,-529.31119999999999,2077.5722000000001]
[101,"Varme","Andet (varme) ","Pumpe","Magna3 25-40","Magna3 25-(40/60/80/100/120)",1,0,0,0,51.3,0,0,54.642599999999987,0,3.33,1.26E-2,-3.6,109.2852]
[102,"Varme","Radiatorer","Radiator ","Radiator, 142/2000","Panel radiator 500mm x 700mm - Lyngson",1,0,0,0,33.763542839309999,0,0,33.764342907881002,0,0,8.0006857100599989E-4,-59.883428539799993,67.528685815762003]
[103,"Varme","Radiatorer","Radiator ","Radiator, 200/1000","Panel radiator 500mm x 700mm - Lyngson",1,0,0,0,47.554285678619998,0,0,47.555412535762009,0,0,1.126857142012E-3,-84.342857079599995,95.110825071524019]
[104,"Varme","Radiatorer","Radiator ","Radiator, 200/1100","Panel radiator 500mm x 700mm - Lyngson",1,0,0,0,26.15485716069,0,0,26.15547693211899,0,0,6.1977142899399991E-4,-46.388571460199998,52.31095386423798]
[105,"Varme","Radiatorer","Radiator ","Radiator, 200/2000","Panel radiator 500mm x 700mm - Lyngson",1,0,0,0,95.108571440460011,0,0,95.11082515474601,0,0,2.2537142859959999E-3,-168.68571430680001,190.22165030949199]
[106,"Varme","Radiatorer","Radiator ","Radiator, 200/600","Panel radiator 500mm x 700mm - Lyngson",1,0,0,0,14.26628572023,0,0,14.266623777373001,0,0,3.3805714299799989E-4,-25.302857153400002,28.533247554745991]
[107,"Varme","Radiatorer","Radiator ","Radiator, 300/400","Panel radiator 500mm x 700mm - Lyngson",1,0,0,0,14.26628572023,0,0,14.266623777373001,0,0,3.3805714299799989E-4,-25.302857153400002,28.533247554745991]
[108,"Varme","Radiatorer","Radiator ","Radiator, 600/900","Panel radiator 500mm x 700mm - Lyngson",1,0,0,0,64.198285720230004,0,0,64.199806977373001,0,0,1.521257142998E-3,-113.8628571534,128.399613954746]
[109,"Varme","Varmeforsyningsanlæg","Varmepumpe","Varmepumpe luft til vand ","Varmepumpe (luft-vand) 10 kW",1,0,0,0,284.57441999999998,0,0,305.88212119999997,0,18.653009999999998,2.6546911999999998,-299.48604,611.76424239999994]
[110,"Varme","Varmerør","Varmerør","Press rør","Brugsvandsrør, rustfri stål",0,0,0,0,447.94563310000001,0,0,0,0,0,8.5841919850000004E-2,-335.24877335000002,448.03147501985001]
[111,"Ventilation og køl ","Ventilationskanaler","Afkast emhætte","Ventilationskanaler Ø125, enfamiliehuse og etageboliger, central","Ventilationskanal, galvaniseret stål",0,0,0,0,4.6470104999999986,0,0,0,0,2.4963792499999998E-3,0,-2.4193820000000001,4.6495068792499996]
[112,"Vinduer, døre, glasfacader","Døre","Indvendige døre","Dør, indvendig","Fastgørelsesmidler/skruer i galvaniseret stål",0,0,0,0,14.220039999999999,0,0,0,0,0,2.72828E-3,-7.2424799999999996,14.22276828]
[113,"Vinduer, døre, glasfacader","Døre","Indvendige døre","Dør, indvendig","Overflade, Indendørsmaling, emulsions maling, slidstærk",0,0,0,0,3.7483588999999999,0,0,0,0,0,2.1457865E-2,-1.547689E-2,3.7698167649999998]
[114,"Vinduer, døre, glasfacader","Døre","Indvendige døre","Dør, indvendig","Spånplade",0,0,0,0,-164.73486857142859,0,0,0,0,239.19720000000001,0,-0.55332325714285713,74.462331428571417]
[115,"Vinduer, døre, glasfacader","Døre","Indvendige døre","Dør, indvendig","Træ, fyrretræ (12% fugt / 10,7% H2O)",0,0,0,0,-57.079373177842569,0,0,0,0,71.796574344023327,0,-18.974781341107871,14.717201166180759]
[116,"Vinduer, døre, glasfacader","Døre","Udvendig dør","Udvendig dør, træ","Grå støbejern",0,0,0,0,0.1717128,0,0,0,0,0,7.1617350000000013E-5,-4.1265000000000003E-2,0.17178441735]
[117,"Vinduer, døre, glasfacader","Døre","Udvendig dør","Udvendig dør, træ","Høvlede konstruktionstræsprodukter af fyr og gran, Fobrænding",0,0,0,0,-5.0294078947368419,0,0,0,0,5.4647894736842098,0,-2.784940789473684,0.43538157894736779]
[118,"Vinduer, døre, glasfacader","Døre","Udvendig dør","Udvendig dør, træ","Savede og tørrede konstruktionstræprodukter af fyr og gran, Fobrænding",1,0,0,0,-70.554473684210521,0,0,4.9803157894736927,0,75.534789473684214,0,-76.987381578947364,9.9606315789473854]
[119,"Vinduer, døre, glasfacader","Vinduer","Facadevinduer ","Facadevinduer","3-lags-rude",0,0,0,0,0,0,0,1080.34762,0,56.750011999999998,9.183383000000001,-26.281541000000001,1146.281015]
[120,"Vinduer, døre, glasfacader","Vinduer","Facadevinduer ","Facadevinduer","Trævindue med 3-lags rude",0,0,0,0,953.26,0,0,0,0,415.8,22.44,-378.4,1391.5]
[121,"Vinduer, døre, glasfacader","Vinduer","Ovenlys","Velux GGL ovenlys m. aluinddækning, 3-lagsrude (træ)","3-lags-rude",0,0,0,0,0,0,0,441.96039000000002,0,23.215913999999991,3.7568384999999989,-10.7515395,468.93314249999997]
[122,"Vinduer, døre, glasfacader","Vinduer","Ovenlys","Velux GGL ovenlys m. aluinddækning, 3-lagsrude (træ)","Velux GGL ovenlys m. aluinddækning, 3-lagsrude (træ)",0,0,0,0,657.9,0,0,0,0,2.2410000000000001,55.799999999999983,0,715.94099999999992]
[123,"Vinduer, døre, glasfacader","Vinduer","Ovenlys","Velux modular skylight, 3-lagsrude","3-lags-rude",0,0,0,0,0,0,0,98.213419999999999,0,5.1590919999999993,0.83485300000000007,-2.3892310000000001,104.207365]
[124,"Vinduer, døre, glasfacader","Vinduer","Ovenlys","Velux modular skylight, 3-lagsrude","Velux modular skylight, 3-lagsrude",0,0,0,0,390.86,0,0,0,0,6.98,2.64,-55,400.48]
[125,"Ydervægge","Ydervægge","Ydervæg, trækassette","Facadekassette uden beklædning","Cembrit Windstopper Extreme, 9 mm",0,0,0,0,1360.12,0,0,0,0,0,27.528000000000009,0,1387.6479999999999]
[126,"Ydervægge","Ydervægge","Ydervæg, trækassette","Facadekassette uden beklædning","Dampspærre PE (tykkelse 0,0002 m)",0,0,0,0,59.111791999999987,0,0,0,0,82.280748000000003,0,-40.620376,141.39254]
[127,"Ydervægge","Ydervægge","Ydervæg, trækassette","Facadekassette uden beklædning","Fermacell fiberplade 12,5 mm",0,0,0,0,337.44,0,0,0,0,0,59.558352399999997,0,396.99835239999999]
[128,"Ydervægge","Ydervægge","Ydervæg, trækassette","Facadekassette uden beklædning","OSB-plade",0,0,0,0,-1525.6887839999999,0,0,0,0,2880.0450719999999,0,-836.28128159999983,1354.3562879999999]
[129,"Ydervægge","Ydervægge","Ydervæg, trækassette","Facadekassette uden beklædning","Papirisolering kl 37 - ISOCELL",0,0,0,0,-2275.5,0,0,0,0,2682.5,0,-826.95,407]
[130,"Ydervægge","Ydervægge","Ydervæg, trækassette","Facadekassette uden beklædning","Papirisolering kl 37 - ISOCELL",0,0,0,0,-347.69639999999998,0,0,0,0,409.88600000000002,0,-126.35796000000001,62.189600000000041]
[131,"Ydervægge","Ydervægge","Ydervæg, trækassette","Facadekassette uden beklædning","Savede og tørrede konstruktionstræprodukter af fyr og gran, Fobrænding",0,0,0,0,-4428.16,0,0,0,0,4740.735999999999,0,-2415.9519999999989,312.57599999999911]
[132,"Ydervægge","Ydervægge","Ydervæg, trækassette","Facadekassette uden beklædning","Savede og tørrede konstruktionstræprodukter af fyr og gran, Fobrænding",0,0,0,0,-704.48,0,0,0,0,754.20799999999997,0,-384.35599999999999,49.727999999999952]
[133,"Ydervægge","Ydervægge","Ydervæg, trækassette","Tilbagetrukket facadekassette uden beklædning","Cembrit Windstopper Extreme, 9 mm",0,0,0,0,82.71,0,0,0,0,0,1.6739999999999999,0,84.384]
[134,"Ydervægge","Ydervægge","Ydervæg, trækassette","Tilbagetrukket facadekassette uden beklædning","Dampspærre PE (tykkelse 0,0002 m)",0,0,0,0,3.5946359999999999,0,0,0,0,5.0035590000000001,0,-2.4701580000000001,8.5981950000000005]
[135,"Ydervægge","Ydervægge","Ydervæg, trækassette","Tilbagetrukket facadekassette uden beklædning","Fermacell fiberplade 12,5 mm",0,0,0,0,20.52,0,0,0,0,0,3.6217917000000002,0,24.141791699999999]
[136,"Ydervægge","Ydervægge","Ydervæg, trækassette","Tilbagetrukket facadekassette uden beklædning","OSB-plade",0,0,0,0,-92.77837199999999,0,0,0,0,175.13787600000001,0,-50.854942799999989,82.359503999999987]
[137,"Ydervægge","Ydervægge","Ydervæg, trækassette","Tilbagetrukket facadekassette uden beklædning","Papirisolering kl 37 - ISOCELL",0,0,0,0,-91.881,0,0,0,0,108.315,0,-33.390900000000002,16.434000000000001]
[138,"Ydervægge","Ydervægge","Ydervæg, trækassette","Tilbagetrukket facadekassette uden beklædning","Papirisolering kl 37 - ISOCELL",0,0,0,0,-21.143699999999999,0,0,0,0,24.9255,0,-7.6839299999999993,3.7818000000000001]
[139,"Ydervægge","Ydervægge","Ydervæg, trækassette","Tilbagetrukket facadekassette uden beklædning","Savede og tørrede konstruktionstræprodukter af fyr og gran, Fobrænding",0,0,0,0,-177.48,0,0,0,0,190.00800000000001,0,-96.831000000000003,12.52799999999999]
[140,"Ydervægge","Ydervægge","Ydervæg, trækassette","Tilbagetrukket facadekassette uden beklædning","Savede og tørrede konstruktionstræprodukter af fyr og gran, Fobrænding",0,0,0,0,-42.84,0,0,0,0,45.863999999999997,0,-23.373000000000001,3.0239999999999938]
[141,"Ydervægge","Ydervægge","Ydervæg, trækassette","Træbeklædning med ophæng","Savede og tørrede konstruktionstræprodukter af fyr og gran, Fobrænding",0,0,0,0,-201.28,0,0,0,0,215.488,0,-109.816,14.208]
[142,"Ydervægge","Ydervægge","Ydervæg, trækassette","Træbeklædning med ophæng","Savede og tørrede konstruktionstræprodukter af fyr og gran, Fobrænding",0,0,0,0,-402.56,0,0,0,0,430.976,0,-219.63200000000001,28.416]
[143,"Ydervægge","Ydervægge","Ydervæg, trækassette","Træbeklædning med ophæng","Træbeklædning 19 mm, ubehandlet gran - InnTre Kjeldstad AS",1,0,0,0,-2060.6039999999998,0,0,392.6660816000001,0,2453.1,0.1700816,-275.07427999999999,785.3321632000002]
[144,"Ydervægge","Ydervægge","Ydervæg, trækassette","Træbeklædning tilbagetrukket med ophæng","Savede og tørrede konstruktionstræprodukter af fyr og gran, Fobrænding",0,0,0,0,-12.24,0,0,0,0,13.103999999999999,0,-6.6779999999999999,0.86399999999999721]
[145,"Ydervægge","Ydervægge","Ydervæg, trækassette","Træbeklædning tilbagetrukket med ophæng","Savede og tørrede konstruktionstræprodukter af fyr og gran, Fobrænding",0,0,0,0,-24.48,0,0,0,0,26.207999999999998,0,-13.356,1.727999999999994]
[146,"Ydervægge","Ydervægge","Ydervæg, trækassette","Træbeklædning tilbagetrukket med ophæng","Træbeklædning 19 mm, ubehandlet gran - InnTre Kjeldstad AS",1,0,0,0,-125.307,0,0,23.878342800000009,0,149.17500000000001,1.0342799999999999E-2,-16.72749,47.756685600000019]

{"sheet":"Flet","index":7,"n_rows":254,"n_cols":25,"rows_kept":254,"cut":false,"hidden":true,"merged":[]}
["Indeks","Gruppe","Undergruppe","Bygningsdel","Konstruktion","Byggevare","Indtastet mængde","Column4","Beregnet mængde","Column6","Vægt","Column8","Udskiftninger ","GWP ex_c3","GWP ex_c4","GWP ex_d","GWP a1_3","GWP a4","GWP a5","GWP b4","GWP b6","GWP c3","GWP c4","GWP d","GWP sum"]
[1,"Altaner og altangange","Altanbund","Altaner","Altaner, 1500x3000","Stålprofil",759,"kg/stk.",46299,"kg",46299,"kg",0,0,0,0,59854.291582799997,0,0,0,0,0,41.052906608999997,-23654.159100000001,59895.344489408999]
[2,"Altaner og altangange","Altanbund","Altaner","Altaner, 1500x3250","Stålprofil",803,"kg/stk.",8030,"kg",8030,"kg",0,0,0,0,10381.000916000001,0,0,0,0,0,7.1201287300000002,-4102.527,10388.12104473]
[3,"Andet","Andet","Badekabine","Badekabine, let","Armeringsnet",24.2,"kg/stk.",1476.2,"kg",1476.2,"kg",0,0,0,0,1311.3992463,0,0,0,0,0,1.3089332542000001,-754.19058000000007,1312.7081795541999]
[4,"Andet","Andet","Badekabine","Badekabine, let","EPS 30 kg/m3",3,"kg/stk.",6.1,"m³",183,"kg",0,0,0,0,631.47809999999993,0,0,0,0,0,678.7165,-342.61259999999999,1310.1946]
[5,"Andet","Andet","Badekabine","Badekabine, let","Fabriksbeton (C30/37, C35/45 SCC), C35/45 SCC (gulv)",1042.8,"kg/stk.",28.221295474711621,"m³",63610.8,"kg",0,0,0,0,9313.0275066548365,0,0,0,0,203.02399964507549,149.9397428571429,-138.76410984915711,9665.9912491570558]
[6,"Andet","Andet","Badekabine","Badekabine, let","Flugger Sandplast S",41,"kg/stk.",2501,"kg",2501,"kg",0,0,0,0,865.34599999999989,0,0,0,0,6.6601629999999998,0,0,872.0061629999999]
[7,"Andet","Andet","Badekabine","Badekabine, let","Gyproc Normal (12,5 mm)",22.24,"m²/stk.",1356.64,"m²",12209.76,"kg",0,0,0,0,2984.6080000000002,0,0,0,0,0,162.79679999999999,27.132799999999989,3147.4047999999998]
[8,"Andet","Andet","Badekabine","Badekabine, let","Gyproc stålprofiler og tilbehør",41,"kg/stk.",2501,"kg",2501,"kg",0,0,0,0,7252.9,0,0,0,0,6.0023999999999997,0,-4001.6,7258.9023999999999]
[9,"Andet","Andet","Badekabine","Badekabine, let","Keramikfliser, glaseret",8.15,"m²/stk.",497.15,"m²",9943,"kg",0,0,0,0,3993.902748550001,0,0,0,0,94.839913480000021,0,-26.549540082,4088.7426620300012]
[10,"Andet","Andet","Badekabine","Badekabine, let","Mørtel, fliseklæber",44.2,"kg/stk.",2696.2,"kg",2696.2,"kg",0,0,0,0,1216.3679819199999,0,0,0,0,0,57.376780682000017,-10.007822565,1273.744762602]
[11,"Andet","Andet","Badekabine","Badekabine, let","PIR Sandwichpanel",76,"kg/stk.",965.83333333333337,"m²",4636,"kg",0,0,0,0,36218.75,0,0,0,0,357.35833333333329,10527.58333333333,-17964.5,47103.691666666673]
[12,"Andet","Andet","Badekabine","Badekabine, let","Silikatmaling (indendørs)",5.8,"kg/stk.",353.8,"kg",353.8,"kg",3,0,0,0,439.24270000000001,0,0,1321.4025606600001,0,1.22482022,0,0,1761.8700808799999]
[13,"Andet","Andet","Badekabine","Badekabine, tung","Armeringsnet",24.2,"kg/stk.",605,"kg",605,"kg",0,0,0,0,537.45870750000006,0,0,0,0,0,0.53644805500000003,-309.09449999999998,537.995155555]
[14,"Andet","Andet","Badekabine","Badekabine, tung","EPS 30 kg/m3",3,"kg/stk.",2.5,"m³",75,"kg",0,0,0,0,258.80250000000001,0,0,0,0,0,278.16250000000002,-140.41499999999999,536.96500000000003]
[15,"Andet","Andet","Badekabine","Badekabine, tung","Fabriksbeton (C30/37, C35/45 SCC), C35/45 SCC (gulv)",1042.8,"kg/stk.",11.566104702750669,"m³",26070,"kg",0,0,0,0,3816.8145519077202,0,0,0,0,83.206557231588292,61.450714285714291,-56.87053682342502,3961.4718234250231]
[16,"Andet","Andet","Badekabine","Badekabine, tung","Flugger Sandplast S",41,"kg/stk.",1025,"kg",1025,"kg",0,0,0,0,354.65,0,0,0,0,2.7295750000000001,0,0,357.37957499999999]
[17,"Andet","Andet","Badekabine","Badekabine, tung","Keramikfliser, glaseret",8.15,"m²/stk.",203.75,"m²",4075,"kg",0,0,0,0,1636.84538875,0,0,0,0,38.868817,0,-10.88095905,1675.71420575]
[18,"Andet","Andet","Badekabine","Badekabine, tung","Letbeton vægelement, Letbeton vægelement, 220 mm tyk væg, 10% udsparinger",2394.6999999999998,"kg/stk.",151.6400709219858,"m²",59867.499999999993,"kg",0,0,0,0,10508.65691489362,0,0,0,0,191.82468971631201,139.44820921985809,-155.29459663120571,10839.929813829791]
[19,"Andet","Andet","Badekabine","Badekabine, tung","Mørtel, fliseklæber",44.2,"kg/stk.",1105,"kg",1105,"kg",0,0,0,0,498.51146799999998,0,0,0,0,0,23.515074049999999,-4.1015666250000002,522.0265420500001]
[20,"Andet","Andet","Badekabine","Badekabine, tung","Silikatmaling (indendørs)",5.8,"kg/stk.",145,"kg",145,"kg",3,0,0,0,180.01750000000001,0,0,541.55842650000011,0,0.50197550000000002,0,0,722.07790199999999]
[21,"Andet","Andet","Elevator","Elevator","Elevator (grundkomponenter pr. stk.)",1,"stk./stk.",4,"stk.",6412,"kg",1,0,0,0,27003.599999999999,0,0,27223.437332000001,0,194.44723999999999,25.390091999999999,-16428.256000000001,54446.874664000003]
[22,"Andet","Andet","Elevator","Elevator","Elevator (komponenter pr. etage)",6.75,"stk./stk.",27,"stk.",8991,"kg",1,0,0,0,34022.043899999997,0,0,34032.4046829,0,10.3607829,0,-34618.147199999999,68064.8093658]
[23,"Dæk","Etagedæk","Affaldsrum, gulv (331002)","Gulvopbygning 70 mm","FutureCEM_Fabriksbeton (C20/25 SCC og C25/30) i eksponeringsklasserne X0 og XC1, Fabriksbeton C25/31 (gulv)",7.0000000000000007E-2,"m³/m²",4.9000000000000004,"m³",11005.4,"kg",0,0,0,0,1051.05,0,0,0,0,36.27470000000001,26.7883,-24.794,1114.1130000000001]
[24,"Dæk","Etagedæk","Affaldsrum, gulv (331002)","Gulvopbygning 70 mm","ISOVER Trinlydsplade, 25 mm",4,"m²/m²",280,"m²",875,"kg",0,0,0,0,655.19999999999993,0,0,0,0,0,13.692,0,668.89199999999994]
[25,"Dæk","Etagedæk","Affaldsrum, loft (339001)","Affaldsrum, loft","EPS 80 (38 mm)",7.89,"m²/m²",549.93299999999999,"m²",313.46181000000001,"kg",0,0,0,0,961.83281700000009,0,0,0,0,1161.458496,0,-485.75581890000012,2123.2913130000002]
[26,"Dæk","Etagedæk","Affaldsrum, loft (339001)","Affaldsrum, loft","Træbetonplade",3.5000000000000003E-2,"m³/m²",2.4394999999999998,"m³",878.22,"kg",0,0,0,0,-93.142232365000012,0,0,0,0,1006.76091425,0,-360.88060189999999,913.618681885]
[27,"Dæk","Etagedæk","Bolig, gulv (332001)","Gulvopbygning, standard","FutureCEM_Fabriksbeton (C20/25 SCC og C25/30) i eksponeringsklasserne X0 og XC1, Fabriksbeton C25/31 (gulv)",0.06,"m³/m²",252.34200000000001,"m³",566760.13199999998,"kg",0,0,0,0,54127.358999999997,0,0,0,0,1868.0878259999999,1379.5537139999999,-1276.85052,57375.000539999994]
[28,"Dæk","Etagedæk","Bolig, gulv (332001)","Gulvopbygning, standard","ISOVER Trinlydsplade, 25 mm",4,"m²/m²",16822.8,"m²",52571.25,"kg",0,0,0,0,39365.351999999999,0,0,0,0,0,822.63491999999997,0,40187.986920000003]
[29,"Dæk","Etagedæk","Bolig, gulv (332001)","Gulvopbygning, standard","Trægulv, stavparket, 22 mm",0.68,"m²/m²",2859.8760000000002,"m²",32888.574000000001,"kg",0,0,0,0,-55951.243236720002,0,0,0,0,87759.21309012,0,-23667.204124979999,31807.969853400002]
[30,"Dæk","Etagedæk","Bolig, loft (351001, 353002)","Akustik, ekstra","Træbetonplade",3.5000000000000003E-2,"m³/m²",22.12,"m³",7963.2000000000007,"kg",0,0,0,0,-844.56084440000006,0,0,0,0,9128.7359800000031,0,-3272.260264,8284.1751356000022]
[31,"Dæk","Etagedæk","Bolig, loft (351001, 353002)","Loft, nedhængt","Fastgørelsesmidler/skruer i galvaniseret stål",0.1,"kg/m²",73.410000000000011,"kg",73.410000000000011,"kg",0,0,0,0,339.26526933000002,0,0,0,0,0,6.5091986310000016E-2,-172.79289846,339.33036131631002]
[32,"Dæk","Etagedæk","Bolig, loft (351001, 353002)","Loft, nedhængt","Gyproc Normal (12,5 mm)",2,"m²/m²",1468.2,"m²",13213.8,"kg",0,0,0,0,3230.04,0,0,0,0,0,176.184,29.364000000000001,3406.2240000000011]
[33,"Dæk","Etagedæk","Bolig, loft (351001, 353002)","Loft, nedhængt","Gyproc stålprofiler og tilbehør",2,"kg/m²",1468.2,"kg",1468.2,"kg",0,0,0,0,4257.78,0,0,0,0,3.5236800000000001,0,-2349.12,4261.30368]
[34,"Dæk","Etagedæk","Bolig, loft (351001, 353002)","Loft, nedhængt","ISOVER Formstykker kl. 37 (37 mm)",1.22,"m²/m²",895.60199999999998,"m²",497.05910999999998,"kg",0,0,0,0,394.96048200000001,0,0,0,0,0,7.77382536,0,402.73430736]
[35,"Dæk","Etagedæk","Bolig, loft (351001, 353002)","Loft, påbygget","Fastgørelsesmidler/skruer i galvaniseret stål",0.1,"kg/m²",65.88,"kg",65.88,"kg",0,0,0,0,304.46527644000003,0,0,0,0,0,5.8415203079999999E-2,-155.06873927999999,304.52369164307993]
[36,"Dæk","Etagedæk","Bolig, loft (351001, 353002)","Loft, påbygget","Gyproc Normal (12,5 mm)",2,"m²/m²",1317.6,"m²",11858.4,"kg",0,0,0,0,2898.72,0,0,0,0,0,158.11199999999999,26.352,3056.8319999999999]
[37,"Dæk","Etagedæk","Bolig, loft (351001, 353002)","Loft, påbygget","Gyproc stålprofiler og tilbehør",2,"kg/m²",1317.6,"kg",1317.6,"kg",0,0,0,0,3821.04,0,0,0,0,3.1622400000000002,0,-2108.16,3824.2022400000001]
[38,"Dæk","Etagedæk","Bolig, loft (351001, 353002)","Loft, påbygget","ISOVER Formstykker kl. 37 (37 mm)",1.22,"m²/m²",803.73599999999988,"m²",446.07348000000002,"kg",0,0,0,0,354.44757600000003,0,0,0,0,0,6.9764284799999992,0,361.42400448000001]
[39,"Dæk","Etagedæk","Bolig, loft (351001, 353002)","Loft, påbygget","Fastgørelsesmidler/skruer i galvaniseret stål",0.1,"kg/m²",225.03,"kg",225.03,"kg",0,0,0,0,1039.9790703900001,0,0,0,0,0,0.19953207573000001,-529.67696418000003,1040.1786024657299]
[40,"Dæk","Etagedæk","Bolig, loft (351001, 353002)","Loft, påbygget","Gyproc Normal (12,5 mm)",2,"m²/m²",4500.6000000000004,"m²",40505.4,"kg",0,0,0,0,9901.3200000000015,0,0,0,0,0,540.072,90.012000000000015,10441.392]
[41,"Dæk","Etagedæk","Bolig, loft (351001, 353002)","Loft, påbygget","Gyproc stålprofiler og tilbehør",2,"kg/m²",4500.6000000000004,"kg",4500.6000000000004,"kg",0,0,0,0,13051.74,0,0,0,0,10.801439999999999,0,-7200.9600000000009,13062.541440000001]
[42,"Dæk","Etagedæk","Bolig, loft (351001, 353002)","Loft, påbygget","ISOVER Formstykker kl. 37 (37 mm)",1.22,"m²/m²",2745.366,"m²",1523.67813,"kg",0,0,0,0,1210.706406,0,0,0,0,0,23.829776880000001,0,1234.5361828800001]
[43,"Dæk","Etagedæk","Bolig, loft (351001, 353002)","Vægside, malerbehandling, silikatmaling, fuldspartling","Puds, kalk-gips, inde",0.45,"kg/m²",0.36704999999999999,"m³",330.34500000000003,"kg",0,0,0,0,94.884260250000011,0,0,0,0,0,6.4441133250000009,0,101.328373575]
[44,"Dæk","Etagedæk","Bolig, loft (351001, 353002)","Vægside, malerbehandling, silikatmaling, fuldspartling","Silikatmaling (indendørs)",0.38,"kg/m²",278.95800000000003,"kg",278.95800000000003,"kg",3,0,0,0,346.32635699999997,0,0,1041.8762451006,0,0.96572470020000012,0,0,1389.1683268008001]
[45,"Dæk","Etagedæk","Bolig, loft (351001, 353002)","Vægside, malerbehandling, silikatmaling, fuldspartling","Puds, kalk-gips, inde",0.45,"kg/m²",0.32940000000000003,"m³",296.45999999999998,"kg",0,0,0,0,85.151546999999994,0,0,0,0,0,5.7831110999999993,0,90.934658100000007]
[46,"Dæk","Etagedæk","Bolig, loft (351001, 353002)","Vægside, malerbehandling, silikatmaling, fuldspartling","Silikatmaling (indendørs)",0.38,"kg/m²",250.34399999999999,"kg",250.34399999999999,"kg",3,0,0,0,310.802076,0,0,935.00622568079996,0,0.8666658935999999,0,0,1246.6749675743999]
[47,"Dæk","Etagedæk","Bolig, loft (351001, 353002)","Vægside, malerbehandling, silikatmaling, fuldspartling","Puds, kalk-gips, inde",0.45,"kg/m²",1.1251500000000001,"m³",1012.635,"kg",0,0,0,0,290.85690075000002,0,0,0,0,0,19.753695974999999,0,310.61059672500011]
[48,"Dæk","Etagedæk","Bolig, loft (351001, 353002)","Vægside, malerbehandling, silikatmaling, fuldspartling","Silikatmaling (indendørs)",0.38,"kg/m²",855.11400000000003,"kg",855.11400000000003,"kg",3,0,0,0,1061.6240310000001,0,0,3193.7530504697988,0,2.9603191566000011,0,0,4258.3374006264003]
[49,"Dæk","Etagedæk","Dæk mod kælder","Dæk, betonelement, forspændt huldæk 0,22/12,0 m","Huldæk element, 22 cm, 6-10 liner",1,"m²/m²",1400,"m²",482440.00000000012,"kg",0,0,0,0,76692,0,0,0,0,1601.6,1170.4000000000001,-1085.7,79464]
[50,"Dæk","Etagedæk","Etagedæk (231001-231002)","CLT-dæk 250 mm","CLT, Södra",0.25,"m³/m²",860.02499999999998,"m³",369810.75,"kg",0,0,0,0,-576216.75,0,0,0,0,605457.6,0,83422.425000000003,29240.84999999998]
[51,"Dæk","Etagedæk","Etagedæk (231001-231002)","Dæk, betonelement, forspændt huldæk 0,22/12,0 m","Huldæk element, 22 cm, 6-10 liner",1,"m²/m²",760,"m²",261896,"kg",0,0,0,0,41632.800000000003,0,0,0,0,869.44000000000017,635.36000000000024,-589.38000000000011,43137.600000000013]
[52,"Dæk","Etagedæk","Fælledhus, loft (357003)","Loft, akustik","Fastgørelsesmidler/skruer i galvaniseret stål",0.1,"kg/m²",5.8000000000000007,"kg",5.8000000000000007,"kg",0,0,0,0,26.8047754,0,0,0,0,0,5.1428078000000012E-3,-13.652074799999999,26.809918207799999]
[53,"Dæk","Etagedæk","Fælledhus, loft (357003)","Loft, akustik","Gyproc stålprofiler og tilbehør",2,"kg/m²",116,"kg",116,"kg",0,0,0,0,336.4,0,0,0,0,0.27839999999999998,0,-185.6,336.67840000000001]
[54,"Dæk","Etagedæk","Fælledhus, loft (357003)","Loft, akustik","Træbetonplade",0.05,"m³/m²",2.9,"m³",1044,"kg",0,0,0,0,-110.724523,0,0,0,0,1196.8053500000001,0,-429.00338000000011,1086.080827]
[55,"Dæk","Etagedæk","Fællesarealer, gulv (332002)","Gulvopbygning, standard","FutureCEM_Fabriksbeton (C20/25 SCC og C25/30) i eksponeringsklasserne X0 og XC1, Fabriksbeton C25/31 (gulv)",0.06,"m³/m²",13.08,"m³",29377.68,"kg",0,0,0,0,2805.66,0,0,0,0,96.831240000000008,71.508359999999996,-66.184799999999996,2973.9996000000001]
[56,"Dæk","Etagedæk","Fællesarealer, gulv (332002)","Gulvopbygning, standard","ISOVER Trinlydsplade, 25 mm",4,"m²/m²",872,"m²",2725,"kg",0,0,0,0,2040.48,0,0,0,0,0,42.640799999999999,0,2083.1208000000001]
[57,"Dæk","Etagedæk","Fællesarealer, gulv (332002)","Gulvopbygning, standard","Trægulv, stavparket, 22 mm",0.68,"m²/m²",148.24,"m²",1704.76,"kg",0,0,0,0,-2900.1999728000001,0,0,0,0,4548.9474888000004,0,-1226.7756852,1648.747516000001]
[58,"Dæk","Etagedæk","Loft (353001)","Loft, gips","Fastgørelsesmidler/skruer i galvaniseret stål",0.1,"kg/m²",21.89,"kg",21.89,"kg",0,0,0,0,101.16491957,0,0,0,0,0,1.9409665990000002E-2,-51.524813340000001,101.18432923599001]
[59,"Dæk","Etagedæk","Loft (353001)","Loft, gips","Gyproc Protect (15,4 mm)",2,"m²/m²",437.8,"m²",5560.0599999999986,"kg",0,0,0,0,1400.96,0,0,0,0,6.1291999999999991,0,0,1407.0891999999999]
[60,"Dæk","Etagedæk","Loft (353001)","Loft, gips","Gyproc stålprofiler og tilbehør",2,"kg/m²",437.8,"kg",437.8,"kg",0,0,0,0,1269.6199999999999,0,0,0,0,1.0507200000000001,0,-700.48,1270.6707200000001]
[61,"Dæk","Etagedæk","Loft (353001)","Vægside, malerbehandling, silikatmaling, fuldspartling","Puds, kalk-gips, inde",0.45,"kg/m²",0.10945000000000001,"m³",98.50500000000001,"kg",0,0,0,0,28.293372250000001,0,0,0,0,0,1.921558925,0,30.214931175]
[62,"Dæk","Etagedæk","Loft (353001)","Vægside, malerbehandling, silikatmaling, fuldspartling","Silikatmaling (indendørs)",0.38,"kg/m²",83.182000000000002,"kg",83.182000000000002,"kg",3,0,0,0,103.270453,0,0,310.67526229740002,0,0.2879677658,0,0,414.23368306320009]
[63,"Dæk","Etagedæk","Rørkasse (225003)","Træskelet 45 mm","Fastgørelsesmidler/skruer i galvaniseret stål",0.05,"kg/m²",11.58,"kg",11.58,"kg",0,0,0,0,53.517120539999993,0,0,0,0,0,1.026788178E-2,-27.257073479999999,53.527388421780003]
[64,"Dæk","Etagedæk","Rørkasse (225003)","Træskelet 45 mm","ISOVER Formstykker kl. 37 (37 mm)",1.22,"m²/m²",282.55200000000002,"m²",156.81636,"kg",0,0,0,0,124.60543199999999,0,0,0,0,0,2.4525513600000002,0,127.05798335999999]
[65,"Dæk","Etagedæk","Rørkasse (225003)","Træskelet 45 mm","Savede og tørrede konstruktionstræprodukter af fyr og gran, Fobrænding",4.4999999999999997E-3,"m³/m²",1.0422,"m³",475.24319999999989,"kg",0,0,0,0,-779.56560000000002,0,0,0,0,834.59375999999986,0,-425.32181999999989,55.028159999999943]
[66,"Dæk","Etagedæk","Rørkasse (225003)","Vægside, gipskartonplade 2 lag","Fastgørelsesmidler/skruer i galvaniseret stål",0.05,"kg/m²",11.58,"kg",11.58,"kg",0,0,0,0,53.517120539999993,0,0,0,0,0,1.026788178E-2,-27.257073479999999,53.527388421780003]
[67,"Dæk","Etagedæk","Rørkasse (225003)","Vægside, gipskartonplade 2 lag","Gyproc Normal (12,5 mm)",2,"m²/m²",463.2,"m²",4168.8,"kg",0,0,0,0,1019.04,0,0,0,0,0,55.584000000000003,9.2639999999999993,1074.624]
[68,"Dæk","Etagedæk","Rørkasse (225003)","Vægside, malerbehandling, silikatmaling, fuldspartling","Puds, kalk-gips, inde",0.45,"kg/m²",0.1158,"m³",104.22,"kg",0,0,0,0,29.934878999999999,0,0,0,0,0,2.0330427000000002,0,31.967921700000002]
[69,"Dæk","Etagedæk","Rørkasse (225003)","Vægside, malerbehandling, silikatmaling, fuldspartling","Silikatmaling (indendørs)",0.38,"kg/m²",88.007999999999996,"kg",88.007999999999996,"kg",3,0,0,0,109.261932,0,0,328.69982068559989,0,0.30467489520000002,0,0,438.26642758079993]
[70,"Dæk","Etagedæk","Trappeopgang, loft (357001)","Trappeopgang, loft","Gyproc Normal (12,5 mm)",2,"m²/m²",331.2,"m²",2980.8,"kg",0,0,0,0,728.64,0,0,0,0,0,39.743999999999993,6.6239999999999988,768.38400000000001]
[71,"Dæk","Etagedæk","Trappeopgang, loft (357001)","Trappeopgang, loft","Træbetonplade",3.5000000000000003E-2,"m³/m²",5.7960000000000003,"m³",2086.56,"kg",0,0,0,0,-221.29632251999999,0,0,0,0,2391.959934,0,-857.41503120000004,2170.6636114799999]
[72,"El- og mekaniske anlæg","Energiproduktion","Solceller","Solceller","Solcelleanlæg 1000 kWh / m2*a",1,"m²/m²",273,"m²",2457,"kg",1,0,0,0,105293.86139999999,0,0,109601.06976,0,0,4307.2083600000014,-25695.68274,219202.13952]
[73,"Fundamenter","Pælefundering","Fundament, pæle","Beton C45/55 inkl. armering","Armeringsnet",110,"kg/m³",1991,"kg",1991,"kg",0,0,0,0,1768.7277465,0,0,0,0,0,1.765401781,-1017.2019,1770.493148281]
[74,"Fundamenter","Pælefundering","Fundament, pæle","Beton C45/55 inkl. armering","FutureCEM_Fabriksbeton(C40/50, C45/55), C45/55 (Fundament)",1,"m³/m³",18.100000000000001,"m³",40344.9,"kg",0,0,0,0,7247.2400000000016,0,0,0,0,134.39250000000001,99.350900000000024,-91.98420000000003,7480.9834000000019]
[75,"Fundamenter","Randfundamenter","Fundament (punkt, bjælke og sokkel)","Beton C45/55 inkl. armering","Armeringsnet",110,"kg/m³",7194.0000000000009,"kg",7194.0000000000009,"kg",0,0,0,0,6390.872631000002,0,0,0,0,0,6.3788550540000006,-3675.414600000001,6397.2514860540014]
[76,"Fundamenter","Randfundamenter","Fundament (punkt, bjælke og sokkel)","Beton C45/55 inkl. armering","FutureCEM_Fabriksbeton(C40/50, C45/55), C45/55 (Fundament)",1,"m³/m³",65.400000000000006,"m³",145776.6,"kg",0,0,0,0,26186.16,0,0,0,0,485.59500000000008,358.98060000000009,-332.36279999999999,27030.735600000011]
[77,"Fundamenter","Randfundamenter","Sokkel","Betonelement 250 mm","Armeringsnet",18,"kg/m²",3186,"kg",3186,"kg",0,0,0,0,2830.319739,0,0,0,0,0,2.8249975260000002,-1627.7274,2833.1447365260001]
[78,"Fundamenter","Randfundamenter","Sokkel","Betonelement 250 mm","FutureCEM_Fabriksbeton (C30/37, C35/45 SCC), C35/45 SCC (gulv)",0.25,"m³/m²",44.25,"m³",99739.5,"kg",0,0,0,0,11584.65,0,0,0,0,318.33449999999999,235.10024999999999,-217.57724999999999,12138.08475]
[79,"Fundamenter","Randfundamenter","Sokkel","Sokkel","EPS 80 (38 mm)",5.26,"m²/m²",931.02,"m²",530.68139999999994,"kg",0,0,0,0,1628.3539800000001,0,0,0,0,1966.3142399999999,0,-822.36996600000009,3594.66822]
[80,"Fundamenter","Randfundamenter","Sokkel","Sokkel","Letklinkerbetonblok, ydervæg",0.1,"m³/m²",17.7,"m³",8867.6999999999989,"kg",0,0,0,0,3958.8705,0,0,0,0,77.380098899999979,0,-23.631039900000001,4036.2505989000001]
[81,"Fundamenter","Randfundamenter","Sokkel","Sokkel","Mørtel, fliseklæber",4.8,"kg/m²",849.6,"kg",849.6,"kg",0,0,0,0,383.28990335999998,0,0,0,0,0,18.080006256000001,-3.15356652,401.36990961599997]
[82,"Indervægge","Bærende indervægge","Betonvægge (221003-221004)","Betonelement 200 mm","FutureCEM_Beton vægelementer, Beton vægelementer, 20 cm tyk væg,  med 16-25 kg armering",1,"m²/m²",2772,"m²",1202770.8,"kg",0,0,0,0,194234.04,0,0,0,0,3933.4680000000012,2841.8544000000011,-3293.1360000000009,201009.36240000001]
[83,"Indervægge","Bærende indervægge","Betonvægge (221003-221004)","Betonelement 230 mm","FutureCEM_Beton vægelementer, Beton vægelementer, 20 cm tyk væg,  med 16-25 kg armering",1.1499999999999999,"m²/m²",547.4,"m²",237516.86,"kg",0,0,0,0,38356.317999999999,0,0,0,0,776.76060000000007,561.19448000000011,-650.3112000000001,39694.273079999999]
[84,"Indervægge","Bærende indervægge","Betonvægge (221003-221004)","Vægside, malerbehandling, silikatmaling, fuldspartling","Puds, kalk-gips, inde",0.45,"kg/m²",3.2863500000000001,"m³",2957.7150000000001,"kg",0,0,0,0,849.53790675000005,0,0,0,0,0,57.696803775000006,0,907.23471052500008]
[85,"Indervægge","Bærende indervægge","Betonvægge (221003-221004)","Vægside, malerbehandling, silikatmaling, fuldspartling","Silikatmaling (indendørs)",0.38,"kg/m²",2497.6260000000002,"kg",2497.6260000000002,"kg",3,0,0,0,3100.802678999999,0,0,9328.347631348197,0,8.6465314493999994,0,0,12437.796841797601]
[86,"Indervægge","Ikke-bærende indervægge","Fortsatsvæg i affaldsrum (224015)","Slag- og vandfast plade","Cembrit Windstopper Basic",11.7,"kg/m²",87.8,"m²",1027.26,"kg",0,0,0,0,395.1,0,0,0,0,0,15.41458944,0,410.51458944000001]
[87,"Indervægge","Ikke-bærende indervægge","Fortsatsvæg i affaldsrum (224015)","Træskelet 195 mm","Fastgørelsesmidler/skruer i galvaniseret stål",0.05,"kg/m²",4.3899999999999997,"kg",4.3899999999999997,"kg",0,0,0,0,20.288442069999999,0,0,0,0,0,3.8925734900000001E-3,-10.333208340000001,20.292334643490001]
[88,"Indervægge","Ikke-bærende indervægge","Fortsatsvæg i affaldsrum (224015)","Træskelet 195 mm","ISOVER Formstykker kl. 37 (37 mm)",5.27,"m²/m²",462.70600000000002,"m²",256.80183,"kg",0,0,0,0,204.053346,0,0,0,0,0,4.0162880799999998,0,208.06963407999999]
[89,"Indervægge","Ikke-bærende indervægge","Fortsatsvæg i affaldsrum (224015)","Træskelet 195 mm","Savede og tørrede konstruktionstræprodukter af fyr og gran, Fobrænding",1.95E-2,"m³/m²",1.7121,"m³",780.71759999999995,"kg",0,0,0,0,-1280.6507999999999,0,0,0,0,1371.0496800000001,0,-698.70800999999994,90.398879999999608]
[90,"Indervægge","Ikke-bærende indervægge","Glasvæg ved køkken (226001)","Glasvæg (komplet væg)","Aluminiumsprofil",0.5,"kg/m²",334,"kg",334,"kg",0,0,0,0,4635.9534000000003,0,0,0,0,0,0.296154794,-3589.8700760000002,4636.2495547939998]
[91,"Indervægge","Ikke-bærende indervægge","Glasvæg ved køkken (226001)","Glasvæg (komplet væg)","Fastgørelsesmidler/skruer i galvaniseret stål",0.05,"kg/m²",33.4,"kg",33.4,"kg",0,0,0,0,154.35853420000001,0,0,0,0,0,2.9615479399999999E-2,-78.61712039999999,154.38814967939999]
[92,"Indervægge","Ikke-bærende indervægge","Glasvæg ved køkken (226001)","Glasvæg (komplet væg)","Glas 3 mm",5.67,"m²/m²",3787.56,"m²",37875.599999999999,"kg",0,0,0,0,65629.211029200014,0,0,0,0,0,806.01587211600008,0,66435.226901316011]
[93,"Indervægge","Ikke-bærende indervægge","Glasvæg ved køkken (226001)","Glasvæg (komplet væg)","Tætningsliste, EPDB, ekstruderet",0.03,"kg/m²",20.04,"kg",20.04,"kg",0,0,0,0,108.57900456,0,0,0,0,74.94561204,0,-44.176376400000002,183.5246166]
[94,"Indervægge","Ikke-bærende indervægge","Lejlighedsskel (224001)","Stålskelet 2x70 mm","Fastgørelsesmidler/skruer i galvaniseret stål",0.05,"kg/m²",4.0215000000000014,"kg",4.0215000000000014,"kg",0,0,0,0,18.5854145295,0,0,0,0,0,3.5658278565E-3,-9.4658308290000015,18.588980357356501]
[95,"Indervægge","Ikke-bærende indervægge","Lejlighedsskel (224001)","Stålskelet 2x70 mm","Gyproc stålprofiler og tilbehør",3.7,"kg/m²",297.59100000000012,"kg",297.59100000000012,"kg",0,0,0,0,863.01390000000015,0,0,0,0,0.71421840000000014,0,-476.14560000000012,863.7281184000002]
[96,"Indervægge","Ikke-bærende indervægge","Lejlighedsskel (224001)","Stålskelet 2x70 mm","ISOVER Formstykker kl. 37 (37 mm)",3.78,"m²/m²",304.02539999999999,"m²",168.73409699999999,"kg",0,0,0,0,134.0752014,0,0,0,0,0,2.6389404719999998,0,136.714141872]
[97,"Indervægge","Ikke-bærende indervægge","Lejlighedsskel (224001)","Vægside, gipskartonplade 2 lag","Fastgørelsesmidler/skruer i galvaniseret stål",0.05,"kg/m²",8.043000000000001,"kg",8.043000000000001,"kg",0,0,0,0,37.170829058999999,0,0,0,0,0,7.1316557130000008E-3,-18.931661657999999,37.177960714713002]
[98,"Indervægge","Ikke-bærende indervægge","Lejlighedsskel (224001)","Vægside, gipskartonplade 2 lag","Gyproc Normal (12,5 mm)",2,"m²/m²",321.72000000000003,"m²",2895.48,"kg",0,0,0,0,707.78400000000011,0,0,0,0,0,38.606400000000001,6.434400000000001,746.39040000000011]
[99,"Indervægge","Ikke-bærende indervægge","Lejlighedsskel (224001)","Vægside, malerbehandling, silikatmaling, fuldspartling","Puds, kalk-gips, inde",0.45,"kg/m²",8.0430000000000015E-2,"m³",72.387000000000015,"kg",0,0,0,0,20.79155715000001,0,0,0,0,0,1.412069295,0,22.203626445000008]
[100,"Indervægge","Ikke-bærende indervægge","Lejlighedsskel (224001)","Vægside, malerbehandling, silikatmaling, fuldspartling","Silikatmaling (indendørs)",0.38,"kg/m²",61.126800000000003,"kg",61.126800000000003,"kg",3,0,0,0,75.88892220000001,0,0,228.30161120675999,0,0.21161486892,0,0,304.40214827568002]
[101,"Indervægge","Ikke-bærende indervægge","Rørkasse (225003)","Træskelet 45 mm","Fastgørelsesmidler/skruer i galvaniseret stål",0.05,"kg/m²",18.763999999999999,"kg",18.763999999999999,"kg",0,0,0,0,86.718069931999992,0,0,0,0,0,1.6637869924000001E-2,-44.166815783999994,86.734707801923975]
[102,"Indervægge","Ikke-bærende indervægge","Rørkasse (225003)","Træskelet 45 mm","ISOVER Formstykker kl. 37 (37 mm)",1.22,"m²/m²",457.84160000000003,"m²",254.10208800000001,"kg",0,0,0,0,201.90814560000001,0,0,0,0,0,3.9740650880000001,0,205.88221068799999]
[103,"Indervægge","Ikke-bærende indervægge","Rørkasse (225003)","Træskelet 45 mm","Savede og tørrede konstruktionstræprodukter af fyr og gran, Fobrænding",4.4999999999999997E-3,"m³/m²",1.68876,"m³",770.07455999999991,"kg",0,0,0,0,-1263.1924799999999,0,0,0,0,1352.3590079999999,0,-689.18295599999988,89.166527999999872]
[104,"Indervægge","Ikke-bærende indervægge","Rørkasse (225003)","Vægside, gipskartonplade 2 lag","Fastgørelsesmidler/skruer i galvaniseret stål",0.05,"kg/m²",18.763999999999999,"kg",18.763999999999999,"kg",0,0,0,0,86.718069931999992,0,0,0,0,0,1.6637869924000001E-2,-44.166815783999994,86.734707801923975]
[105,"Indervægge","Ikke-bærende indervægge","Rørkasse (225003)","Vægside, gipskartonplade 2 lag","Gyproc Normal (12,5 mm)",2,"m²/m²",750.56,"m²",6755.0399999999991,"kg",0,0,0,0,1651.232,0,0,0,0,0,90.067199999999971,15.011200000000001,1741.2991999999999]
[106,"Indervægge","Ikke-bærende indervægge","Rørkasse (225003)","Vægside, malerbehandling, silikatmaling, fuldspartling","Puds, kalk-gips, inde",0.45,"kg/m²",0.18764,"m³",168.876,"kg",0,0,0,0,48.505878199999998,0,0,0,0,0,3.2943016599999999,0,51.80017986]
[107,"Indervægge","Ikke-bærende indervægge","Rørkasse (225003)","Vægside, malerbehandling, silikatmaling, fuldspartling","Silikatmaling (indendørs)",0.38,"kg/m²",142.60640000000001,"kg",142.60640000000001,"kg",3,0,0,0,177.04584560000001,0,0,532.61860408847997,0,0.4936890961599999,0,0,710.15813878463985]
[108,"Indervægge","Ikke-bærende indervægge","Skaktvæg (224003)","Træskelet 70 mm","Fastgørelsesmidler/skruer i galvaniseret stål",0.05,"kg/m²",54.55,"kg",54.55,"kg",0,0,0,0,252.10353415,0,0,0,0,0,4.836899405000001E-2,-128.40011730000001,252.15190314405001]
[109,"Indervægge","Ikke-bærende indervægge","Skaktvæg (224003)","Træskelet 70 mm","ISOVER Formstykker kl. 37 (37 mm)",1.89,"m²/m²",2061.9899999999998,"m²",1144.40445,"kg",0,0,0,0,909.33758999999986,0,0,0,0,0,17.898073199999999,0,927.23566319999986]
[110,"Indervægge","Ikke-bærende indervægge","Skaktvæg (224003)","Træskelet 70 mm","Savede og tørrede konstruktionstræprodukter af fyr og gran, Fobrænding",7.0000000000000001E-3,"m³/m²",7.6369999999999996,"m³",3482.4720000000002,"kg",0,0,0,0,-5712.4760000000006,0,0,0,0,6115.709600000001,0,-3116.6597000000011,403.23360000000099]
[111,"Indervægge","Ikke-bærende indervægge","Skaktvæg (224003)","Vægside, gipskartonplade 2 lag","Fastgørelsesmidler/skruer i galvaniseret stål",0.05,"kg/m²",54.55,"kg",54.55,"kg",0,0,0,0,252.10353415,0,0,0,0,0,4.836899405000001E-2,-128.40011730000001,252.15190314405001]
[112,"Indervægge","Ikke-bærende indervægge","Skaktvæg (224003)","Vægside, gipskartonplade 2 lag","Gyproc Normal (12,5 mm)",2,"m²/m²",2182,"m²",19638,"kg",0,0,0,0,4800.4000000000015,0,0,0,0,0,261.83999999999997,43.64,5062.2400000000007]
[113,"Indervægge","Ikke-bærende indervægge","Skaktvæg (224003)","Vægside, malerbehandling, silikatmaling, fuldspartling","Puds, kalk-gips, inde",0.45,"kg/m²",0.54549999999999998,"m³",490.95,"kg",0,0,0,0,141.0144775,0,0,0,0,0,9.5770707500000007,0,150.59154824999999]
[114,"Indervægge","Ikke-bærende indervægge","Skaktvæg (224003)","Vægside, malerbehandling, silikatmaling, fuldspartling","Silikatmaling (indendørs)",0.38,"kg/m²",414.58,"kg",414.58,"kg",3,0,0,0,514.70106999999996,0,0,1548.4089135060001,0,1.4352345019999999,0,0,2064.5452180080001]
[115,"Indervægge","Ikke-bærende indervægge","Skillevæg 120 mm (224005)","Træskelet 70 mm","Fastgørelsesmidler/skruer i galvaniseret stål",0.05,"kg/m²",4.25,"kg",4.25,"kg",0,0,0,0,19.641430249999999,0,0,0,0,0,3.76843675E-3,-10.0036755,19.64519868675]
[116,"Indervægge","Ikke-bærende indervægge","Skillevæg 120 mm (224005)","Træskelet 70 mm","ISOVER Formstykker kl. 37 (37 mm)",1.89,"m²/m²",160.65,"m²",89.160750000000007,"kg",0,0,0,0,70.846649999999997,0,0,0,0,0,1.394442,0,72.241091999999995]
[117,"Indervægge","Ikke-bærende indervægge","Skillevæg 120 mm (224005)","Træskelet 70 mm","Savede og tørrede konstruktionstræprodukter af fyr og gran, Fobrænding",7.0000000000000001E-3,"m³/m²",0.59499999999999997,"m³",271.32,"kg",0,0,0,0,-445.06,0,0,0,0,476.476,0,-242.81950000000001,31.416]
[118,"Indervægge","Ikke-bærende indervægge","Skillevæg 120 mm (224005)","Vægside, gipskartonplade 2 lag","Fastgørelsesmidler/skruer i galvaniseret stål",0.05,"kg/m²",8.5,"kg",8.5,"kg",0,0,0,0,39.282860499999998,0,0,0,0,0,7.5368735000000001E-3,-20.007351,39.290397373499999]
[119,"Indervægge","Ikke-bærende indervægge","Skillevæg 120 mm (224005)","Vægside, gipskartonplade 2 lag","Gyproc Normal (12,5 mm)",2,"m²/m²",340,"m²",3060,"kg",0,0,0,0,748.00000000000011,0,0,0,0,0,40.799999999999997,6.8,788.80000000000007]
[120,"Indervægge","Ikke-bærende indervægge","Skillevæg 120 mm (224005)","Vægside, malerbehandling, silikatmaling, fuldspartling","Puds, kalk-gips, inde",0.45,"kg/m²",8.5000000000000006E-2,"m³",76.5,"kg",0,0,0,0,21.972925,0,0,0,0,0,1.4923025000000001,0,23.465227500000001]
[121,"Indervægge","Ikke-bærende indervægge","Skillevæg 120 mm (224005)","Vægside, malerbehandling, silikatmaling, fuldspartling","Silikatmaling (indendørs)",0.38,"kg/m²",64.599999999999994,"kg",64.599999999999994,"kg",3,0,0,0,80.20089999999999,0,0,241.27361622000001,0,0.22363874,0,0,321.69815496000001]
[122,"Indervægge","Ikke-bærende indervægge","Skillevæg 95 mm (224009)","Træskelet 45 mm","Fastgørelsesmidler/skruer i galvaniseret stål",0.05,"kg/m²",114.5745,"kg",114.5745,"kg",0,0,0,0,529.50754121850002,0,0,0,0,0,0.1015921779795,-269.68614554700002,529.60913339647948]
[123,"Indervægge","Ikke-bærende indervægge","Skillevæg 95 mm (224009)","Træskelet 45 mm","ISOVER Formstykker kl. 37 (37 mm)",1.22,"m²/m²",2795.6178,"m²",1551.5678789999999,"kg",0,0,0,0,1232.8674498,0,0,0,0,0,24.265962504000001,0,1257.1334123040001]
[124,"Indervægge","Ikke-bærende indervægge","Skillevæg 95 mm (224009)","Træskelet 45 mm","Savede og tørrede konstruktionstræprodukter af fyr og gran, Fobrænding",4.4999999999999997E-3,"m³/m²",10.311705,"m³",4702.1374799999994,"kg",0,0,0,0,-7713.1553399999993,0,0,0,0,8257.6133639999989,0,-4208.2068104999998,544.45802400000002]
[125,"Indervægge","Ikke-bærende indervægge","Skillevæg 95 mm (224009)","Vægside, gipskartonplade 2 lag","Fastgørelsesmidler/skruer i galvaniseret stål",0.05,"kg/m²",229.149,"kg",229.149,"kg",0,0,0,0,1059.015082437,0,0,0,0,0,0.203184355959,-539.37229109400005,1059.218266792959]
[126,"Indervægge","Ikke-bærende indervægge","Skillevæg 95 mm (224009)","Vægside, gipskartonplade 2 lag","Gyproc Normal (12,5 mm)",2,"m²/m²",9165.9599999999991,"m²",82493.639999999985,"kg",0,0,0,0,20165.112000000001,0,0,0,0,0,1099.9151999999999,183.31919999999991,21265.0272]
[127,"Indervægge","Ikke-bærende indervægge","Skillevæg 95 mm (224009)","Vægside, malerbehandling, silikatmaling, fuldspartling","Puds, kalk-gips, inde",0.45,"kg/m²",2.29149,"m³",2062.3409999999999,"kg",0,0,0,0,592.36162245000003,0,0,0,0,0,40.230544185000007,0,632.59216663500001]
[128,"Indervægge","Ikke-bærende indervægge","Skillevæg 95 mm (224009)","Vægside, malerbehandling, silikatmaling, fuldspartling","Silikatmaling (indendørs)",0.38,"kg/m²",1741.5324000000001,"kg",1741.5324000000001,"kg",3,0,0,0,2162.1124746,0,0,6504.4244568466784,0,6.0290110155599992,0,0,8672.565942462239]
[129,"Søjler og bjælker","Søjler","Søjler og bjælker","Beton C45/55 inkl. armering","Armeringsnet",110,"kg/m³",6160,"kg",6160,"kg",0,0,0,0,5472.3068400000002,0,0,0,0,0,5.4620165600000004,-3147.1439999999998,5477.7688565600001]
[130,"Søjler og bjælker","Søjler","Søjler og bjælker","Beton C45/55 inkl. armering","FutureCEM_Fabriksbeton(C40/50, C45/55), C45/55 (Fundament)",1,"m³/m³",56,"m³",124824,"kg",0,0,0,0,22422.400000000001,0,0,0,0,415.8,307.38400000000001,-284.59199999999998,23145.583999999999]
[131,"Søjler og bjælker","Søjler","Søjler og bjælker","Beton C45/55 inkl. armering","Armeringsnet",110,"kg/m³",2200,"kg",2200,"kg",0,0,0,0,1954.3952999999999,0,0,0,0,0,1.9507201999999999,-1123.98,1956.3460202000001]
[132,"Søjler og bjælker","Søjler","Søjler og bjælker","Beton C45/55 inkl. armering","FutureCEM_Fabriksbeton(C40/50, C45/55), C45/55 (Fundament)",1,"m³/m³",20,"m³",44580,"kg",0,0,0,0,8008.0000000000009,0,0,0,0,148.5,109.78,-101.64,8266.2800000000007]
[133,"Søjler og bjælker","Søjler","Søjler og bjælker","Samlinger","Stålprofil",1,"kg/kg",101853.8,"kg",101853.8,"kg",0,0,0,0,131674.27037335999,0,0,0,0,0,90.312847775800009,-52037.106419999996,131764.58322113581]
[134,"Søjler og bjælker","Søjler","Søjler og bjælker","Stålbjælker","Stålprofil",1,"kg/kg",2221.5500000000002,"kg",2221.5500000000002,"kg",0,0,0,0,2871.9691886599999,0,0,0,0,0,1.9698283910500001,-1134.9898949999999,2873.939017051051]
[135,"Søjler og bjælker","Søjler","Søjler og bjælker","Søjler, limtræ","Limtræs-produkter af fyr og gran, Fobrænding",1,"m³/m³",174,"m³",87000,"kg",0,0,0,0,-116754,0,0,0,0,142210.20000000001,0,-75603,25456.2]
[136,"Søjler og bjælker","Søjler","Søjler og bjælker, kælder","Beton C45/55 inkl. armering","Armeringsnet",110,"kg/m³",5918,"kg",5918,"kg",0,0,0,0,5257.3233570000002,0,0,0,0,0,5.2474373380000001,-3023.5061999999998,5262.5707943380003]
[137,"Søjler og bjælker","Søjler","Søjler og bjælker, kælder","Beton C45/55 inkl. armering","FutureCEM_Fabriksbeton(C40/50, C45/55), C45/55 (Fundament)",1,"m³/m³",53.8,"m³",119920.2,"kg",0,0,0,0,21541.52,0,0,0,0,399.46499999999997,295.3082,-273.41160000000002,22236.2932]
[138,"Søjler og bjælker","Søjler","Søjler og bjælker, kælder","Kompositbjælke, 1-sidet, 220/250 (til 220 mm dæk)","FutureCEM_Fabriksbeton (C30/37, C35/45 SCC), C35/45 SCC (gulv)",221.76,"kg/m",1.633192546583851,"m³",3681.2159999999999,"kg",0,0,0,0,427.56980869565223,0,0,0,0,11.749187180124229,8.6771520000000013,-8.0304077515527954,447.9961478757765]
[139,"Søjler og bjælker","Søjler","Søjler og bjælker, kælder","Kompositbjælke, 1-sidet, 220/250 (til 220 mm dæk)","Stålprofil",56.023800000000001,"kg/m",929.99508000000014,"kg",929.99508000000014,"kg",0,0,0,0,1202.276435536176,0,0,0,0,0,0.82461826748028011,-475.13448637200008,1203.101053803656]
[140,"Søjler og bjælker","Søjler","Søjler og bjælker, kælder","Kompositbjælke, 2-sidet, 220/400 (til 220 mm dæk)","FutureCEM_Fabriksbeton (C30/37, C35/45 SCC), C35/45 SCC (gulv)",417.12,"kg/m",3.349543921916593,"m³",7549.8720000000003,"kg",0,0,0,0,876.91059875776409,0,0,0,0,24.096618974267969,17.796126857142859,-16.469707464063891,918.8033445891748]
[141,"Søjler og bjælker","Søjler","Søjler og bjælker, kælder","Kompositbjælke, 2-sidet, 220/400 (til 220 mm dæk)","Stålprofil",76.012900000000002,"kg/m",1375.83349,"kg",1375.83349,"kg",0,0,0,0,1778.6461668684281,0,0,0,0,0,1.2199391730815901,-702.91333004100011,1779.86610604151]
[142,"Tage","Tage","Murkrone","Beklædning","Fastgørelsesmidler/skruer i galvaniseret stål",0.15,"kg/m²",24.225000000000001,"kg",24.225000000000001,"kg",0,0,0,0,111.956152425,0,0,0,0,0,2.1480089474999998E-2,-57.02095035,111.977632514475]
[143,"Tage","Tage","Murkrone","Beklædning","Gyproc stålprofiler og tilbehør",3,"kg/m²",484.5,"kg",484.5,"kg",0,0,0,0,1405.05,0,0,0,0,1.1628000000000001,0,-775.2,1406.2128]
[144,"Tage","Tage","Murkrone","Beklædning","Varmebehandlet gran og fyrretræ, MOELVEN",2.1000000000000001E-2,"m³/m²",3.3915000000000002,"m³",1373.5574999999999,"kg",0,0,0,0,-1699.1415,0,0,0,0,2723.3744999999999,7.5630450000000002E-2,-133.28595000000001,1024.30863045]
[145,"Tage","Tage","Murkrone","Murkrone","Cembrit Windstopper Basic",11.7,"kg/m²",161.5,"m²",1889.55,"kg",0,0,0,0,726.75,0,0,0,0,0,28.3537152,0,755.10371520000001]
[146,"Tage","Tage","Murkrone","Murkrone","Gyproc Protect (15,4 mm)",1,"m²/m²",161.5,"m²",2051.0500000000002,"kg",0,0,0,0,516.80000000000007,0,0,0,0,2.2610000000000001,0,0,519.06100000000004]
[147,"Tage","Tage","Murkrone","Murkrone","ISOVER Formstykker kl. 34 (34 mm)",7.21,"m²/m²",1164.415,"m²",783.88417800000002,"kg",0,0,0,0,619.46878000000004,0,0,0,0,0,12.226357500000001,0,631.69513749999999]
[148,"Tage","Tage","Murkrone","Murkrone","Stål, valsede profiler og plader",7.4,"kg/m²",1195.0999999999999,"kg",1195.0999999999999,"kg",0,0,0,0,1747.83375,0,0,0,0,2.86489372,0,-642.27064200000007,1750.6986437200001]
[149,"Tage","Tage","Tag (272001)","CLT dæk inkl isolering","CLT, Södra",0.25,"m³/m²",368.72500000000002,"m³",158551.75,"kg",0,0,0,0,-247045.75,0,0,0,0,259582.4,0,35766.324999999997,12536.649999999991]
[150,"Tage","Tage","Tag (272001)","CLT dæk inkl isolering","Dampspærre PA",1,"m²/m²",1474.9,"m²",117.992,"kg",1,0,0,0,1356.42039806,0,0,1778.09607794,0,421.67567988000002,0,-335.33497488400002,3556.19215588]
[151,"Tage","Tage","Tag (272001)","CLT dæk inkl isolering","Fastgørelsesmidler/skruer i galvaniseret stål",0.1,"kg/m²",147.49,"kg",147.49,"kg",0,0,0,0,681.62695237000003,0,0,0,0,0,0.13077805559,-347.16284694000001,681.75773042559001]
[152,"Tage","Tage","Tag (272001)","CLT dæk inkl isolering","ISOVER Robust Lamel",10.25,"m²/m²",15117.725,"m²",28889.972474999999,"kg",0,0,0,0,21013.637750000002,0,0,0,0,0,452.01997749999998,0,21465.657727500002]
[153,"Tage","Tage","Tag (272001)","Tagbelægning, tagpap","Phønix Tag System 1 (overpap+underpap)",1,"m²/m²",1474.9,"m²",176.988,"kg",0,0,0,0,5471.8789999999999,0,0,0,0,35397.600000000013,14.439271,-12802.132,40883.91827100001]
[154,"Terrændæk","Terrændæk","Terræn/kælderdæk","Beton C45/55 inkl. armering","Armeringsnet",110,"kg/m³",90629,"kg",90629,"kg",0,0,0,0,80511.314383500008,0,0,0,0,0,80.359918639,-46302.356099999997,80591.674302139014]
[155,"Terrændæk","Terrændæk","Terræn/kælderdæk","Beton C45/55 inkl. armering","FutureCEM_Fabriksbeton(C40/50, C45/55), C45/55 (Fundament)",1,"m³/m³",823.9,"m³",1836473.1,"kg",0,0,0,0,329889.56,0,0,0,0,6117.4575000000004,4522.3870999999999,-4187.0598,340529.40460000001]
[156,"Terrændæk","Terrændæk","Terræn/kælderdæk","Isolering, kælderdæk","EPS 80 (38 mm)",6.58,"m²/m²",2697.8,"m²",1537.7460000000001,"kg",0,0,0,0,4718.4522000000006,0,0,0,0,5697.7536,0,-2382.9667400000012,10416.2058]
[157,"Terrændæk","Terrændæk","Terræn/kælderdæk","Isolering, kælderdæk","Lecanødder (Klon)",36.75,"kg/m²",15067.5,"kg",15067.5,"kg",0,0,0,0,6501.35051475,0,0,0,0,52.162178249999997,0,0,6553.5126929999997]
[158,"Terrændæk","Terrændæk","Terræn/kælderdæk","Isolering, terrændæk","EPS 80 (38 mm)",10.53,"m²/m²",4054.05,"m²",2310.8085000000001,"kg",0,0,0,0,7090.5334499999999,0,0,0,0,8562.1535999999996,0,-3580.9423649999999,15652.68705]
[159,"Trapper og ramper","Trapper og ramper","Betontrapper (overslag)","Trappe","Armeringsnet",110,"kg/m³",5841,"kg",5841,"kg",0,0,0,0,5188.9195215,0,0,0,0,0,5.179162131,-2984.1669000000002,5194.0986836310003]
[160,"Trapper og ramper","Trapper og ramper","Betontrapper (overslag)","Trappe","FutureCEM_Fabriksbeton (C30/37, C35/45 SCC), C35/45 SCC (gulv)",1,"m³/m³",53.1,"m³",119687.4,"kg",0,0,0,0,13901.58,0,0,0,0,382.0014000000001,282.1203000000001,-261.09269999999998,14565.7017]
[161,"Trapper og ramper","Trapper og ramper","Trapperepos","Betonelement 250 mm","Armeringsnet",18,"kg/m²",2831.4,"kg",2831.4,"kg",0,0,0,0,2515.3067510999999,0,0,0,0,0,2.5105768974,-1446.5622599999999,2517.8173279974012]
[162,"Trapper og ramper","Trapper og ramper","Trapperepos","Betonelement 250 mm","FutureCEM_Fabriksbeton (C30/37, C35/45 SCC), C35/45 SCC (gulv)",0.25,"m³/m²",39.325000000000003,"m³",88638.55,"kg",0,0,0,0,10295.285,0,0,0,0,282.9040500000001,208.93372500000001,-193.36102500000001,10787.122775]
[163,"Trapper og ramper","Trapper og ramper","Værn","Rækværk, stål","Stål, valsede profiler og plader",17.861999999999998,"kg/m",2139.8676,"kg",2139.8676,"kg",0,0,0,0,3129.556364999999,0,0,0,0,5.1296906107199991,0,-1150.007645592,3134.686055610719]
[164,"Udendørs areal","Belægninger","Terrasser, tag","Træbeklædning, terrasse","Træ, fyrretræ (12% fugt / 10,7% H2O)",2.1000000000000001E-2,"m³/m²",6.8523000000000014,"m³",3760.5422400000002,"kg",1,0,0,0,-6976.1053007100008,0,0,1798.7013408,0,8774.8066415100002,0,-4638.1053373200011,3597.4026816000001]
[165,"Udendørs areal","Udendørs inventar","Skaktboks på tag (214008)","Beklædning","Fastgørelsesmidler/skruer i galvaniseret stål",0.15,"kg/m²",4.8,"kg",4.8,"kg",0,0,0,0,22.1832624,0,0,0,0,0,4.2561168000000002E-3,-11.298268800000001,22.187518516800001]
[166,"Udendørs areal","Udendørs inventar","Skaktboks på tag (214008)","Beklædning","Gyproc stålprofiler og tilbehør",3,"kg/m²",96,"kg",96,"kg",0,0,0,0,278.39999999999998,0,0,0,0,0.23039999999999999,0,-153.6,278.63040000000001]
[167,"Udendørs areal","Udendørs inventar","Skaktboks på tag (214008)","Beklædning","Varmebehandlet gran og fyrretræ, MOELVEN",2.1000000000000001E-2,"m³/m²",0.67200000000000004,"m³",272.16000000000003,"kg",0,0,0,0,-336.67200000000003,0,0,0,0,539.61599999999999,1.49856E-2,-26.409600000000001,202.95898559999989]
[168,"Udendørs areal","Udendørs inventar","Teknikhus på tag (214009)","Beklædning","Fastgørelsesmidler/skruer i galvaniseret stål",0.15,"kg/m²",11.775,"kg",11.775,"kg",0,0,0,0,54.418315575000001,0,0,0,0,0,1.0440786525000001E-2,-27.716065650000001,54.428756361524997]
[169,"Udendørs areal","Udendørs inventar","Teknikhus på tag (214009)","Beklædning","Gyproc stålprofiler og tilbehør",3,"kg/m²",235.5,"kg",235.5,"kg",0,0,0,0,682.94999999999993,0,0,0,0,0.56519999999999992,0,-376.8,683.51519999999994]
[170,"Udendørs areal","Udendørs inventar","Teknikhus på tag (214009)","Beklædning","Varmebehandlet gran og fyrretræ, MOELVEN",2.1000000000000001E-2,"m³/m²",1.6485000000000001,"m³",667.64250000000004,"kg",0,0,0,0,-825.89850000000001,0,0,0,0,1323.7455,3.6761549999999997E-2,-64.786050000000003,497.88376154999997]
[171,"Udendørs areal","Udendørs inventar","Væksthus (315001)","Glasvæg (komplet væg)","Aluminiumsprofil",0.5,"kg/m²",43.2,"kg",43.2,"kg",0,0,0,0,599.62031999999999,0,0,0,0,0,3.8305051200000009E-2,-464.31852480000009,599.65862505120003]
[172,"Udendørs areal","Udendørs inventar","Væksthus (315001)","Glasvæg (komplet væg)","Fastgørelsesmidler/skruer i galvaniseret stål",0.05,"kg/m²",4.32,"kg",4.32,"kg",0,0,0,0,19.964936160000001,0,0,0,0,0,3.8305051200000001E-3,-10.168441919999999,19.96876666512]
[173,"Udendørs areal","Udendørs inventar","Væksthus (315001)","Glasvæg (komplet væg)","Glas 3 mm",5.67,"m²/m²",489.88799999999998,"m²",4898.88,"kg",0,0,0,0,8488.5686121600011,0,0,0,0,0,104.2511547168,0,8592.8197668768007]
[174,"Udendørs areal","Udendørs inventar","Væksthus (315001)","Glasvæg (komplet væg)","Tætningsliste, EPDB, ekstruderet",0.03,"kg/m²",2.5920000000000001,"kg",2.5920000000000001,"kg",0,0,0,0,14.043751488,0,0,0,0,9.6935641920000002,0,-5.7138307199999998,23.737315679999998]
[175,"Vand","Vandrør","Cirkulationspumpe","Cirkulationspumpe","Cirkulationspumpe 50-250 W",1,"stk./stk.",1,"stk.",4.9400000000000004,"kg",1,0,0,0,34.393970000000003,0,0,35.578349559999999,0,1.1257870000000001,5.8592560000000002E-2,-13.161564,71.156699119999999]
[176,"Vand","Varmtvandsbeholder","VVB","Varmtvandsbeholder, central, 50 L per badeværelse (stk.)","Buffertank, rustfri stål",25,"kg/stk.",2000,"kg",2000,"kg",1,0,0,0,10551.606,0,0,12276.563,0,1724.9570000000001,0,-6255.4960000000001,24553.126]
[177,"Varme","Gulvvarme","Gulvvarme","Gulvvarmerør, PEX, 200 mm afstand","Gulvvarme, PEX (200 mm afstand)",1,"m²/m²",5574,"m²",7803.5999999999995,"kg",1,0,0,0,41248.268880000003,0,0,76920.58686000001,0,35672.317980000007,0,-29732.897688000001,153841.17371999999]
[178,"Varme","Radiatorer","Radiator","Radiator 500/1000 mm","Radiator, stålplade",36.6,"kg/stk.",439.2,"kg",439.2,"kg",1,0,0,0,2539.6414992,0,0,2540.1088208246401,0,0.46732162463999999,0,-1780.5159216,5080.2176416492803]
[179,"Varme","Varmeforsyningsanlæg","Fjernvarmeveksler","Fjernvarmeveksler 120-400 kW, kontor, skoler og institutioner og etageboliger","Fjernvarmeanlæg",400,"kg/stk.",400,"kg",400,"kg",1,0,0,0,2480.8159999999998,0,0,2593.2449243999999,0,107.65560000000001,4.7733244000000008,-1279.1271999999999,5186.4898488000008]
[180,"Varme","Varmerør","Alle VVS-rør","Alupex","Brugsvandsrør, Alu-PEX",0.4,"kg/m",608.80000000000007,"kg",608.80000000000007,"kg",1,0,0,0,6031.7620999999999,0,0,7523.0250056000004,0,1491.2629056000001,0,-7594.1042320000006,15046.050011200001]
[181,"Varme","Varmerør","Alle VVS-rør","PEX","Rør, Brugsvandsrør, PEX",0.4,"kg/m",62.8,"kg",62.8,"kg",1,0,0,0,334.99586119999998,0,0,642.65456840000002,0,307.65870719999998,0,-278.48873520000001,1285.3091368]
[182,"Varme","Varmerør","Alle VVS-rør","PP","Rør, Kloakrør PP",0.4,"kg/m",447.2,"kg",447.2,"kg",1,0,0,0,1523.0701824,0,0,3531.3434208000008,0,2008.2732384000001,0,-1983.1236048000001,7062.6868416000016]
[183,"Varme","Varmerør","Alle VVS-rør","Stål","Brugsvandsrør, rustfri stål",1.2,"kg/m",1294.8,"kg",1294.8,"kg",1,0,0,0,5991.0214728000001,0,0,5992.1695603068001,0,0,1.1480875068,-8967.5284296000009,11984.3391206136]
[184,"Ventilation og køl ","Ventilationsanlæg","Ventilationsanlæg, decentral","Ventilationsagregat 120 m3/h, etageboliger, decentral (per lejlighed)","Ventilationsaggregat m. varmegenvinding 1000 m3/h",41,"kg/stk.",33.097880928355202,"stk.",3280,"kg",1,0,0,0,16011.857840565081,0,0,16042.03312300303,0,26.296703289606459,3.8785791483350152,-18251.555035317859,32084.066246006048]
[185,"Ventilation og køl ","Ventilationskanaler","Armaturer","Ventilation, armaturer","Ventilationskanal, galvaniseret stål",1,"kg/kg",382,"kg",382,"kg",1,0,0,0,1513.249452,0,0,1514.062371302,0,0.81291930199999995,0,-1575.6919359999999,3028.1247426039999]
[186,"Ventilation og køl ","Ventilationskanaler","Ventilationskanaler","1400x600","Ventilationskanal, galvaniseret stål",21.6,"kg/m",21.6,"kg",21.6,"kg",0,0,0,0,85.565937599999998,0,0,0,0,4.5966117600000002E-2,0,-44.548358400000012,85.611903717600015]
[187,"Ventilation og køl ","Ventilationskanaler","Ventilationskanaler","600x600","Ventilationskanal, galvaniseret stål",12.96,"kg/m",20.736000000000001,"kg",20.736000000000001,"kg",0,0,0,0,82.143300096000019,0,0,0,0,4.4127472895999997E-2,0,-42.766424064000013,82.187427568896013]
[188,"Ventilation og køl ","Ventilationskanaler","Ventilationskanaler","800x800","Ventilationskanal, galvaniseret stål",17.28,"kg/m",10.368,"kg",10.368,"kg",0,0,0,0,41.071650048000002,0,0,0,0,2.2063736447999999E-2,0,-21.383212031999999,41.093713784447999]
[189,"Ventilation og køl ","Ventilationskanaler","Ventilationskanaler","Teknisk isolering","Mineraluld, stenuld, teknisk pladeisolering",0.05,"m³/m²",24.2,"m³",3542.880000000001,"kg",0,0,0,0,6167.1667200000011,0,0,0,0,0.51499076200000005,0,0,6167.6817107620018]
[190,"Ventilation og køl ","Ventilationskanaler","Ventilationskanaler","ø100","Ventilationskanal, galvaniseret stål",1.1399999999999999,"kg/m",531.46799999999996,"kg",531.46799999999996,"kg",0,0,0,0,2105.3498946479999,0,0,0,0,1.1309963235480001,0,-1096.1123584320001,2106.480890971548]
[191,"Ventilation og køl ","Ventilationskanaler","Ventilationskanaler","ø125","Ventilationskanal, galvaniseret stål",1.41,"kg/m",468.54300000000001,"kg",468.54300000000001,"kg",0,0,0,0,1856.0796805980001,0,0,0,0,0.99708808512299996,0,-966.33432823199996,1857.076768683123]
[192,"Ventilation og køl ","Ventilationskanaler","Ventilationskanaler","ø160","Ventilationskanal, galvaniseret stål",2.02,"kg/m",1694.982,"kg",1694.982,"kg",0,0,0,0,6714.4779650519986,0,0,0,0,3.6070250899020002,0,-3495.7715563679999,6718.0849901419006]
[193,"Ventilation og køl ","Ventilationskanaler","Ventilationskanaler","ø200","Ventilationskanal, galvaniseret stål",2.56,"kg/m",798.20800000000008,"kg",798.20800000000008,"kg",0,0,0,0,3162.0099962879999,0,0,0,0,1.698635314688,0,-1646.243336192,3163.708631602688]
[194,"Ventilation og køl ","Ventilationskanaler","Ventilationskanaler","ø315","Ventilationskanal, galvaniseret stål",4.41,"kg/m",169.34399999999999,"kg",169.34399999999999,"kg",0,0,0,0,670.83695078400001,0,0,0,0,0.36037436198400002,0,-349.25912985600002,671.197325145984]
[195,"Ventilation og køl ","Ventilationskanaler","Ventilationskanaler","ø355","Ventilationskanal, galvaniseret stål",4.96,"kg/m",130.94399999999999,"kg",130.94399999999999,"kg",0,0,0,0,518.71972838399995,0,0,0,0,0.27865681958400002,0,-270.06204825600003,518.99838520358389]
[196,"Ventilation og køl ","Ventilationskanaler","Ventilationskanaler","ø400","Ventilationskanal, galvaniseret stål",6.01,"kg/m",1058.962,"kg",1058.962,"kg",0,0,0,0,4194.9572413320002,0,0,0,0,2.2535357326819998,0,-2184.0286438879998,4197.2107770646817]
[197,"Ventilation og køl ","Ventilationskanaler","Ventilationskanaler","ø630","Ventilationskanal, galvaniseret stål",12,"kg/m",288,"kg",288,"kg",0,0,0,0,1140.8791679999999,0,0,0,0,0.61288156800000004,0,-593.97811200000001,1141.4920495680001]
[198,"Vinduer, døre, glasfacader","Døre","Glasdøre","Karm, vinduer, træ-/aluminium","EPDM-tætning til aluminiumsprofil",5.7750000000000004,"m/m²",1882.65,"m",338.87700000000001,"kg",0,0,0,0,1415.3745756149999,0,0,0,0,1382.54699583,1381.74423387,-1494.0452476949999,4179.6658053150013]
[199,"Vinduer, døre, glasfacader","Døre","Glasdøre","Karm, vinduer, træ-/aluminium","Vindueskarm, aluminium",0.82799999999999996,"m/m²",269.928,"m",385.99704000000003,"kg",0,0,0,0,5534.2150156799999,0,0,0,0,243.33920123760001,0,-3339.534100032,5777.5542169176006]
[200,"Vinduer, døre, glasfacader","Døre","Glasdøre","Karm, vinduer, træ-/aluminium","Vindueskarm, træ",2.87,"m/m²",935.62,"m",1974.1582000000001,"kg",0,0,0,0,-449.760767456,0,0,0,0,4910.0205499799986,0,-1972.99428872,4460.259782524]
[201,"Vinduer, døre, glasfacader","Døre","Glasdøre","Karm, vinduer, træ-/aluminium","Vinduesramme, aluminium",0.86099999999999999,"m/m²",280.68599999999998,"m",423.83586000000003,"kg",0,0,0,0,6223.2296489999999,0,0,0,0,214.55272948199999,0,-3802.24553436,6437.7823784820002]
[202,"Vinduer, døre, glasfacader","Døre","Glasdøre","Karm, vinduer, træ-/aluminium","Vinduesramme, træ",2.76,"m/m²",899.75999999999988,"m",1898.4936,"kg",0,0,0,0,-172.35235711199999,0,0,0,0,4721.8550027999991,0,-1884.7767587999999,4549.5026456879987]
[203,"Vinduer, døre, glasfacader","Døre","Glasdøre","Rude, 3-lags energirude","3-lags-rude (Klon)",1,"m²/m²",326,"m²",9780,"kg",1,0,0,0,24484.027880000001,0,0,25978.28311,0,1286.131288,208.123942,-1191.2424679999999,51956.566220000001]
[204,"Vinduer, døre, glasfacader","Døre","Indvendige døre","Badekabine","Aluminiumsprofil",0.5,"kg/m²",81.55,"kg",81.55,"kg",0,0,0,0,1131.922155,0,0,0,0,0,7.2309651049999993E-2,-876.50869669999997,1131.9944646510501]
[205,"Vinduer, døre, glasfacader","Døre","Indvendige døre","Badekabine","Fastgørelsesmidler/skruer i galvaniseret stål",0.05,"kg/m²",8.1549999999999994,"kg",8.1549999999999994,"kg",0,0,0,0,37.688438514999987,0,0,0,0,0,7.2309651049999998E-3,-19.195287929999999,37.695669480105003]
[206,"Vinduer, døre, glasfacader","Døre","Indvendige døre","Badekabine","Glas 3 mm",5.67,"kg/m²",92.477699999999999,"m²",924.77700000000004,"kg",0,0,0,0,1602.413820189,0,0,0,0,0,19.679818673970001,0,1622.09363886297]
[207,"Vinduer, døre, glasfacader","Døre","Indvendige døre","Badekabine","Tætningsliste, EPDB, ekstruderet",0.03,"kg/m²",4.8929999999999998,"kg",4.8929999999999998,"kg",0,0,0,0,26.510831801999998,0,0,0,0,18.298846293,0,-10.78617813,44.809678095000002]
[208,"Vinduer, døre, glasfacader","Døre","Indvendige døre","Dør, indvendig","Fastgørelsesmidler/skruer i galvaniseret stål",1,"kg/stk.",438,"kg",438,"kg",0,0,0,0,2024.222694,0,0,0,0,0,0.38837065799999998,-1030.967028,2024.611064658]
[209,"Vinduer, døre, glasfacader","Døre","Indvendige døre","Dør, indvendig","Overflade, Indendørsmaling, emulsions maling, slidstærk",0.35749999999999998,"kg/stk.",156.58500000000001,"kg",156.58500000000001,"kg",0,0,0,0,533.57888941499994,0,0,0,0,0,3.05452708275,-2.2031352915000002,536.63341649774998]
[210,"Vinduer, døre, glasfacader","Døre","Indvendige døre","Dør, indvendig","Spånplade",33,"kg/stk.",20.648571428571429,"m³",14454,"kg",0,0,0,0,-23450.008541142859,0,0,0,0,34049.721420000002,0,-78.765565654285709,10599.712878857141]
[211,"Vinduer, døre, glasfacader","Døre","Indvendige døre","Dør, indvendig","Træ, fyrretræ (12% fugt / 10,7% H2O)",10,"kg/stk.",7.981049562682216,"m³",4380,"kg",0,0,0,0,-8125.2487718658886,0,0,0,0,10220.242357871721,0,-2701.060123906705,2094.9935860058299]
[212,"Vinduer, døre, glasfacader","Døre","Indvendige døre","Dør, indvendig, glas","Aluminiumsprofil",0.5,"kg/m²",77.75,"kg",77.75,"kg",0,0,0,0,1079.1777750000001,0,0,0,0,0,6.8940225250000001E-2,-835.6658635,1079.24671522525]
[213,"Vinduer, døre, glasfacader","Døre","Indvendige døre","Dør, indvendig, glas","Fastgørelsesmidler/skruer i galvaniseret stål",0.05,"kg/m²",7.7750000000000004,"kg",7.7750000000000004,"kg",0,0,0,0,35.932263575,0,0,0,0,0,6.8940225250000006E-3,-18.300841649999999,35.939157597525003]
[214,"Vinduer, døre, glasfacader","Døre","Indvendige døre","Dør, indvendig, glas","Glas 3 mm",5.67,"kg/m²",88.168499999999995,"m²",881.68499999999995,"kg",0,0,0,0,1527.745855545,0,0,0,0,0,18.762794627849999,0,1546.5086501728499]
[215,"Vinduer, døre, glasfacader","Døre","Indvendige døre","Dør, indvendig, glas","Tætningsliste, EPDB, ekstruderet",0.03,"kg/m²",4.665,"kg",4.665,"kg",0,0,0,0,25.275501810000002,0,0,0,0,17.446171665000001,0,-10.28357265,42.721673475000003]
[216,"Vinduer, døre, glasfacader","Vinduer","Vinduer","Karm, vinduer, træ-/aluminium","EPDM-tætning til aluminiumsprofil",5.7750000000000004,"m/m²",4279.2750000000015,"m",770.26950000000011,"kg",0,0,0,0,3217.1550936525,0,0,0,0,3142.537803405,3140.713120545,-3395.9740139324999,9500.4060176025014]
[217,"Vinduer, døre, glasfacader","Vinduer","Vinduer","Karm, vinduer, træ-/aluminium","Vindueskarm, aluminium",0.82799999999999996,"m/m²",613.548,"m",877.37363999999991,"kg",0,0,0,0,12579.30468288,0,0,0,0,553.11149729160002,0,-7590.7814973120003,13132.4161801716]
[218,"Vinduer, døre, glasfacader","Vinduer","Vinduer","Karm, vinduer, træ-/aluminium","Vindueskarm, træ",2.87,"m/m²",2126.67,"m",4487.2736999999997,"kg",0,0,0,0,-1022.308983696,0,0,0,0,11160.506832929999,0,-4484.62812252,10138.197849234]
[219,"Vinduer, døre, glasfacader","Vinduer","Vinduer","Karm, vinduer, træ-/aluminium","Vinduesramme, aluminium",0.86099999999999999,"m/m²",638.00099999999998,"m",963.38150999999993,"kg",0,0,0,0,14145.4391715,0,0,0,0,487.67967038699999,0,-8642.5274262599996,14633.118841887001]
[220,"Vinduer, døre, glasfacader","Vinduer","Vinduer","Karm, vinduer, træ-/aluminium","Vinduesramme, træ",2.76,"m/m²",2045.16,"m",4315.2875999999997,"kg",0,0,0,0,-391.75796509200001,0,0,0,0,10732.8053898,0,-4284.1091358000003,10341.047424708]
[221,"Vinduer, døre, glasfacader","Vinduer","Vinduer","Ovenlyskuppel, plast (komplet ovenlys)","Ovenlyskuppel, plast (komplet ovenlys)",1,"m²/m²",2.7,"m²",95.04000000000002,"kg",1,0,0,0,160.40700000000001,0,0,310.21379999999999,0,149.17500000000001,0.63180000000000014,-260.44200000000012,620.4276000000001]
[222,"Vinduer, døre, glasfacader","Vinduer","Vinduer","Rude, 3-lags energirude","3-lags-rude",1,"m²/m²",741,"m²",22230,"kg",1,0,0,0,55652.345580000001,0,0,59048.796885000003,0,2923.3843080000001,473.06699700000001,-2707.7014380000001,118097.59377000001]
[223,"Ydervægge","Kælderydervægge","Kældervægge","Kældervæg, isolering","EPS 80 (38 mm)",5.26,"m²/m²",989.9319999999999,"m²",564.26123999999993,"kg",0,0,0,0,1731.3910679999999,0,0,0,0,2090.7363839999998,0,-874.40693560000011,3822.1274520000002]
[224,"Ydervægge","Kælderydervægge","Kældervægge","Kældervæg, isolering+leca","EPS 80 (38 mm)",6.58,"m²/m²",2508.9540000000002,"m²",1430.1037799999999,"kg",0,0,0,0,4388.160546000001,0,0,0,0,5298.9108480000004,0,-2216.159068200001,9687.0713940000023]
[225,"Ydervægge","Kælderydervægge","Kældervægge","Kældervæg, isolering+leca","Letklinkerbetonblok, ydervæg",0.1,"m³/m²",38.130000000000003,"m³",19103.13,"kg",0,0,0,0,8528.3464500000009,0,0,0,0,166.69509441,0,-50.906867310000003,8695.0415444100017]
[226,"Ydervægge","Kælderydervægge","Kældervægge","Vægelement","FutureCEM_Beton vægelementer, Beton vægelementer, 20 cm tyk væg,  med 16-25 kg armering",1,"m²/m²",936,"m²",406130.4,"kg",0,0,0,0,65585.52,0,0,0,0,1328.184,959.58720000000017,-1111.9680000000001,67873.291200000007]
[227,"Ydervægge","Ydervægge","Ydervægge (214002-214007)","Beklædning","Fastgørelsesmidler/skruer i galvaniseret stål",0.15,"kg/m²",416.85,"kg",416.85,"kg",0,0,0,0,1926.4776940500001,0,0,0,0,0,0.36961714335000001,-981.18403109999986,1926.8473111933499]
[228,"Ydervægge","Ydervægge","Ydervægge (214002-214007)","Beklædning","Gyproc stålprofiler og tilbehør",3,"kg/m²",8337,"kg",8337,"kg",0,0,0,0,24177.3,0,0,0,0,20.008800000000001,0,-13339.2,24197.308799999999]
[229,"Ydervægge","Ydervægge","Ydervægge (214002-214007)","Beklædning","Varmebehandlet gran og fyrretræ, MOELVEN",2.1000000000000001E-2,"m³/m²",58.359000000000002,"m³",23635.395,"kg",0,0,0,0,-29237.859,0,0,0,0,46862.277000000002,1.3014057000000001,-2293.5086999999999,17625.719405700002]
[230,"Ydervægge","Ydervægge","Ydervægge (214002-214007)","Vægside, malerbehandling, silikatmaling, fuldspartling","Puds, kalk-gips, inde",0.45,"kg/m²",1.3895,"m³",1250.55,"kg",0,0,0,0,359.19269750000001,0,0,0,0,0,24.394756749999999,0,383.58745425000001]
[231,"Ydervægge","Ydervægge","Ydervægge (214002-214007)","Vægside, malerbehandling, silikatmaling, fuldspartling","Silikatmaling (indendørs)",0.38,"kg/m²",1056.02,"kg",1056.02,"kg",3,0,0,0,1311.04883,0,0,3944.1139969139999,0,3.6558356380000001,0,0,5258.8186625519993]
[232,"Ydervægge","Ydervægge","Ydervægge (214002-214007)","Ydervæg, let","Cembrit Windstopper Basic",11.7,"kg/m²",2465,"m²",28840.5,"kg",0,0,0,0,11092.5,0,0,0,0,0,432.76723199999998,0,11525.267232]
[233,"Ydervægge","Ydervægge","Ydervægge (214002-214007)","Ydervæg, let","Dampspærre PE (tykkelse 0,0002 m)",1,"m²/m²",2465,"m²",493,"kg",0,0,0,0,1279.890118,0,0,0,0,1781.5449795,0,-879.51347899999996,3061.4350975000002]
[234,"Ydervægge","Ydervægge","Ydervægge (214002-214007)","Ydervæg, let","Gyproc Normal (12,5 mm)",2,"m²/m²",4930,"m²",44370,"kg",0,0,0,0,10846,0,0,0,0,0,591.6,98.600000000000009,11437.6]
[235,"Ydervægge","Ydervægge","Ydervægge (214002-214007)","Ydervæg, let","ISOVER Formstykker kl. 34 (34 mm)",9.26,"m²/m²",22825.9,"m²",15366.39588,"kg",0,0,0,0,12143.3788,0,0,0,0,0,239.67195000000001,0,12383.05075]
[236,"Ydervægge","Ydervægge","Ydervægge (214002-214007)","Ydervæg, let","Savede og tørrede konstruktionstræprodukter af fyr og gran, Fobrænding",3.15E-2,"m³/m²",77.647499999999994,"m³",35407.259999999987,"kg",0,0,0,0,-58080.33,0,0,0,0,62180.117999999988,0,-31687.944749999999,4099.7879999999859]
[237,"Ydervægge","Ydervægge","Ydervægge (214002-214007)","Ydervæg, let","WISA Gran krydsfiner, ubehandlet, Fobrænding",1.4999999999999999E-2,"m³/m²",36.975000000000001,"m³",17748,"kg",0,0,0,0,-26396.452499999999,0,0,0,0,32456.65500000001,0,-15902.9475,6060.2025000000021]
[238,"Ydervægge","Ydervægge","Ydervægge (214002-214007)","Ydervæg, tung, 110 mm iso","Cembrit Windstopper Basic",11.7,"kg/m²",36,"m²",421.2,"kg",0,0,0,0,162,0,0,0,0,0,6.3203327999999992,0,168.32033279999999]
[239,"Ydervægge","Ydervægge","Ydervægge (214002-214007)","Ydervæg, tung, 110 mm iso","FutureCEM_Beton vægelementer, Beton vægelementer, 20 cm tyk væg,  med 16-25 kg armering",1,"m²/m²",36,"m²",15620.4,"kg",0,0,0,0,2522.52,0,0,0,0,51.084000000000003,36.907200000000003,-42.768000000000008,2610.5112000000008]
[240,"Ydervægge","Ydervægge","Ydervægge (214002-214007)","Ydervæg, tung, 110 mm iso","ISOVER Formstykker kl. 32 (32 mm)",3.44,"m²/m²",123.84,"m²",106.99776,"kg",0,0,0,0,85.201920000000001,0,0,0,0,0,1.67184,0,86.873760000000004]
[241,"Ydervægge","Ydervægge","Ydervægge (214002-214007)","Ydervæg, tung, 110 mm iso","Savede og tørrede konstruktionstræprodukter af fyr og gran, Fobrænding",1.0999999999999999E-2,"m³/m²",0.39600000000000002,"m³",180.57599999999999,"kg",0,0,0,0,-296.20800000000003,0,0,0,0,317.11680000000001,0,-161.60759999999999,20.908799999999982]
[242,"Ydervægge","Ydervægge","Ydervægge (214002-214007)","Ydervæg, tung, 120 mm iso","Cembrit Windstopper Basic",11.7,"kg/m²",66,"m²",772.19999999999993,"kg",0,0,0,0,297,0,0,0,0,0,11.5872768,0,308.58727679999998]
[243,"Ydervægge","Ydervægge","Ydervægge (214002-214007)","Ydervæg, tung, 120 mm iso","FutureCEM_Beton vægelementer, Beton vægelementer, 20 cm tyk væg,  med 16-25 kg armering",1,"m²/m²",66,"m²",28637.4,"kg",0,0,0,0,4624.62,0,0,0,0,93.654000000000011,67.663200000000003,-78.408000000000001,4785.9372000000003]
[244,"Ydervægge","Ydervægge","Ydervægge (214002-214007)","Ydervæg, tung, 120 mm iso","ISOVER Formstykker kl. 32 (32 mm)",3.75,"m²/m²",247.5,"m²",213.84,"kg",0,0,0,0,170.28,0,0,0,0,0,3.3412500000000001,0,173.62125]
[245,"Ydervægge","Ydervægge","Ydervægge (214002-214007)","Ydervæg, tung, 120 mm iso","Savede og tørrede konstruktionstræprodukter af fyr og gran, Fobrænding",1.2E-2,"m³/m²",0.79200000000000004,"m³",361.15199999999999,"kg",0,0,0,0,-592.41600000000017,0,0,0,0,634.23360000000002,0,-323.21519999999998,41.817599999999963]
[246,"Ydervægge","Ydervægge","Ydervægge (214002-214007)","Ydervæg, tung, 130 mm iso","Cembrit Windstopper Basic",11.7,"kg/m²",127,"m²",1485.9,"kg",0,0,0,0,571.49999999999989,0,0,0,0,0,22.296729599999999,0,593.79672959999994]
[247,"Ydervægge","Ydervægge","Ydervægge (214002-214007)","Ydervæg, tung, 130 mm iso","FutureCEM_Beton vægelementer, Beton vægelementer, 20 cm tyk væg,  med 16-25 kg armering",1,"m²/m²",127,"m²",55105.3,"kg",0,0,0,0,8898.8900000000012,0,0,0,0,180.21299999999999,130.2004,-150.876,9209.3034000000025]
[248,"Ydervægge","Ydervægge","Ydervægge (214002-214007)","Ydervæg, tung, 130 mm iso","ISOVER Formstykker kl. 32 (32 mm)",4.0599999999999996,"m²/m²",515.62,"m²",445.49567999999999,"kg",0,0,0,0,354.74655999999999,0,0,0,0,0,6.9608699999999999,0,361.70742999999999]
[249,"Ydervægge","Ydervægge","Ydervægge (214002-214007)","Ydervæg, tung, 130 mm iso","Savede og tørrede konstruktionstræprodukter af fyr og gran, Fobrænding",1.2999999999999999E-2,"m³/m²",1.651,"m³",752.85599999999999,"kg",0,0,0,0,-1234.9480000000001,0,0,0,0,1322.1207999999999,0,-673.7731,87.17279999999981]
[250,"Ydervægge","Ydervægge","Ydervægge (214002-214007)","Ydervæg, tung, 220 mm iso","Cembrit Windstopper Basic",11.7,"kg/m²",84,"m²",982.8,"kg",0,0,0,0,378,0,0,0,0,0,14.747443199999999,0,392.74744320000002]
[251,"Ydervægge","Ydervægge","Ydervægge (214002-214007)","Ydervæg, tung, 220 mm iso","FutureCEM_Beton vægelementer, Beton vægelementer, 20 cm tyk væg,  med 16-25 kg armering",1,"m²/m²",84,"m²",36447.599999999999,"kg",0,0,0,0,5885.880000000001,0,0,0,0,119.196,86.116800000000012,-99.792000000000002,6091.1928000000007]
[252,"Ydervægge","Ydervægge","Ydervægge (214002-214007)","Ydervæg, tung, 220 mm iso","ISOVER Formstykker kl. 32 (32 mm)",6.88,"m²/m²",577.91999999999996,"m²",499.32287999999988,"kg",0,0,0,0,397.60896000000002,0,0,0,0,0,7.8019199999999991,0,405.41088000000002]
[253,"Ydervægge","Ydervægge","Ydervægge (214002-214007)","Ydervæg, tung, 220 mm iso","Savede og tørrede konstruktionstræprodukter af fyr og gran, Fobrænding",2.1999999999999999E-2,"m³/m²",1.8480000000000001,"m³",842.68799999999999,"kg",0,0,0,0,-1382.3040000000001,0,0,0,0,1479.8784000000001,0,-754.16880000000003,97.574399999999955]

{"sheet":"Sorteret GWP","index":8,"n_rows":18,"n_cols":28,"rows_kept":18,"cut":false,"hidden":false,"merged":[]}
[]
["Bygningsgrupper",null,null,null,null,null,"Bygningsdele",null,null,null,null,null,"Konstruktioner",null,null,null,null,null,"Byggevarer top 10",null,null,null,null,null,"Byggevarer top 5"]
["Nr.","Navn","GWP [kg CO2/m² år]","Vægt [ton]",null,null,"Nr.","Navn","GWP [kg CO2/m² år]","Vægt [ton]",null,null,"Nr.","Navn","GWP [kg CO2/m² år]","Vægt [ton]",null,null,"Nr.","Navn","GWP [kg CO2/m² år]","Vægt [ton]",null,null,"Nr.","Navn","GWP [kg CO2/m² år]","Vægt [ton]"]
[null,"Alle bygningsgrupper",{"$f":"'Unikke lister'!E3/Bruttoareal/Betragtningstid","v":3.5156478943192933},{"$f":"'Unikke lister'!B3/1000","v":46.763733222854292},null,null,null,"Alle bygningdele",{"$f":"C4","v":3.5156478943192933},{"$f":"D4","v":46.763733222854292},null,null,null,"Alle konstruktioner",{"$f":"I4","v":3.5156478943192933},{"$f":"J4","v":46.763733222854292},null,null,null,"Byggevarer total",{"$f":"O4","v":3.5156478943192933},{"$f":"P4","v":46.763733222854292},null,null,null,"Byggevarer total",{"$f":"U4","v":3.5156478943192933},{"$f":"V4","v":46.763733222854292}]
[1,{"$f":"_xlfn.XLOOKUP(A5,'Unikke lister'!$G$4:$G$20,'Unikke lister'!$A$4:$A$20,\"\",0)","v":"Tage"},{"$f":"_xlfn.XLOOKUP(B5,'Unikke lister'!$A$4:$A$20,'Unikke lister'!$E$4:$E$20,\"\",0)/Bruttoareal/Betragtningstid","v":0.75007674798925894},{"$f":"_xlfn.XLOOKUP(B5,'Unikke lister'!$A$4:$A$20,'Unikke lister'!$B$4:$B$20,\"\",0)/1000","v":12.661061999999999},null,null,1,{"$f":"_xlfn.XLOOKUP(G5,'Unikke lister'!$W$4:$W$100,'Unikke lister'!$Q$4:$Q$100,\"\",0)","v":"Tag, trækassette"},{"$f":"_xlfn.XLOOKUP(H5,'Unikke lister'!$Q$4:$Q$100,'Unikke lister'!$U$4:$U$100,\"\",0)/Bruttoareal/Betragtningstid","v":0.75007674798925894},{"$f":"_xlfn.XLOOKUP(H5,'Unikke lister'!$Q$4:$Q$100,'Unikke lister'!$R$4:$R$100,\"\",0)/1000","v":12.661061999999999},null,null,1,{"$f":"_xlfn.XLOOKUP(M5,'Unikke lister'!$AJ$4:$AJ$200,'Unikke lister'!$AD$4:$AD$200,\"\",0)","v":"Tagkassette, ståltag"},{"$f":"_xlfn.XLOOKUP(N5,'Unikke lister'!$AD$4:$AD$200,'Unikke lister'!$AH$4:$AH$200,\"\",0)/Bruttoareal/Betragtningstid","v":0.67663300451987107},{"$f":"_xlfn.XLOOKUP(N5,'Unikke lister'!$AD$4:$AD$200,'Unikke lister'!$AE$4:$AE$200,\"\",0)/1000","v":10.885992},null,null,1,{"$f":"_xlfn.XLOOKUP(S5,'Unikke lister'!$BD$4:$BD$300,'Unikke lister'!$AX$4:$AX$300,\"\",0)","v":"Facadevindue"},{"$f":"_xlfn.XLOOKUP(T5,'Unikke lister'!$AX$4:$AX$300,'Unikke lister'!$BB$4:$BB$300,\"\",0)/Bruttoareal/Betragtningstid","v":0.37863945578231295},{"$f":"_xlfn.XLOOKUP(T5,'Unikke lister'!$AX$4:$AX$300,'Unikke lister'!$AY$4:$AY$300,\"\",0)/1000","v":0.75240000000000007},null,null,1,{"$f":"_xlfn.XLOOKUP(Y5,'Unikke lister'!$BD$4:$BD$300,'Unikke lister'!$AX$4:$AX$300,\"\",0)","v":"Facadevindue"},{"$f":"_xlfn.XLOOKUP(T5,'Unikke lister'!$AX$4:$AX$300,'Unikke lister'!$BB$4:$BB$300,\"\",0)/Bruttoareal/Betragtningstid","v":0.37863945578231295},{"$f":"_xlfn.XLOOKUP(Z5,'Unikke lister'!$AX$4:$AX$300,'Unikke lister'!$AY$4:$AY$300,\"\",0)/1000","v":0.75240000000000007}]
[2,{"$f":"_xlfn.XLOOKUP(A6,'Unikke lister'!$G$4:$G$20,'Unikke lister'!$A$4:$A$20,\"\",0)","v":"Vinduer, døre, glasfacader"},{"$f":"_xlfn.XLOOKUP(B6,'Unikke lister'!$A$4:$A$20,'Unikke lister'!$E$4:$E$20,\"\",0)/Bruttoareal/Betragtningstid","v":0.69844651907687039},{"$f":"_xlfn.XLOOKUP(B6,'Unikke lister'!$A$4:$A$20,'Unikke lister'!$B$4:$B$20,\"\",0)/1000","v":1.5093835000000002},null,null,2,{"$f":"_xlfn.XLOOKUP(G6,'Unikke lister'!$W$4:$W$100,'Unikke lister'!$Q$4:$Q$100,\"\",0)","v":"Ydervæg, trækassette"},{"$f":"_xlfn.XLOOKUP(H6,'Unikke lister'!$Q$4:$Q$100,'Unikke lister'!$U$4:$U$100,\"\",0)/Bruttoareal/Betragtningstid","v":0.56069043585033995},{"$f":"_xlfn.XLOOKUP(H6,'Unikke lister'!$Q$4:$Q$100,'Unikke lister'!$R$4:$R$100,\"\",0)/1000","v":16.386754699999997},null,null,2,{"$f":"_xlfn.XLOOKUP(M6,'Unikke lister'!$AJ$4:$AJ$200,'Unikke lister'!$AD$4:$AD$200,\"\",0)","v":"Facadekassette uden beklædning"},{"$f":"_xlfn.XLOOKUP(N6,'Unikke lister'!$AD$4:$AD$200,'Unikke lister'!$AH$4:$AH$200,\"\",0)/Bruttoareal/Betragtningstid","v":0.4712234683537414},{"$f":"_xlfn.XLOOKUP(N6,'Unikke lister'!$AD$4:$AD$200,'Unikke lister'!$AE$4:$AE$200,\"\",0)/1000","v":13.726407999999999},null,null,2,{"$f":"_xlfn.XLOOKUP(S6,'Unikke lister'!$BD$4:$BD$300,'Unikke lister'!$AX$4:$AX$300,\"\",0)","v":"Varmepumpe"},{"$f":"_xlfn.XLOOKUP(T6,'Unikke lister'!$AX$4:$AX$300,'Unikke lister'!$BB$4:$BB$300,\"\",0)/Bruttoareal/Betragtningstid","v":0.36589611461224492},{"$f":"_xlfn.XLOOKUP(T6,'Unikke lister'!$AX$4:$AX$300,'Unikke lister'!$AY$4:$AY$300,\"\",0)/1000","v":0.30307999999999996},null,null,2,{"$f":"_xlfn.XLOOKUP(Y6,'Unikke lister'!$BD$4:$BD$300,'Unikke lister'!$AX$4:$AX$300,\"\",0)","v":"Varmepumpe"},{"$f":"_xlfn.XLOOKUP(T6,'Unikke lister'!$AX$4:$AX$300,'Unikke lister'!$BB$4:$BB$300,\"\",0)/Bruttoareal/Betragtningstid","v":0.36589611461224492},{"$f":"_xlfn.XLOOKUP(Z6,'Unikke lister'!$AX$4:$AX$300,'Unikke lister'!$AY$4:$AY$300,\"\",0)/1000","v":0.30307999999999996}]
[3,{"$f":"_xlfn.XLOOKUP(A7,'Unikke lister'!$G$4:$G$20,'Unikke lister'!$A$4:$A$20,\"\",0)","v":"Ydervægge"},{"$f":"_xlfn.XLOOKUP(B7,'Unikke lister'!$A$4:$A$20,'Unikke lister'!$E$4:$E$20,\"\",0)/Bruttoareal/Betragtningstid","v":0.56069043585033995},{"$f":"_xlfn.XLOOKUP(B7,'Unikke lister'!$A$4:$A$20,'Unikke lister'!$B$4:$B$20,\"\",0)/1000","v":16.386754699999997},null,null,3,{"$f":"_xlfn.XLOOKUP(G7,'Unikke lister'!$W$4:$W$100,'Unikke lister'!$Q$4:$Q$100,\"\",0)","v":"Facadevinduer "},{"$f":"_xlfn.XLOOKUP(H7,'Unikke lister'!$Q$4:$Q$100,'Unikke lister'!$U$4:$U$100,\"\",0)/Bruttoareal/Betragtningstid","v":0.37863945578231295},{"$f":"_xlfn.XLOOKUP(H7,'Unikke lister'!$Q$4:$Q$100,'Unikke lister'!$R$4:$R$100,\"\",0)/1000","v":0.75240000000000007},null,null,3,{"$f":"_xlfn.XLOOKUP(M7,'Unikke lister'!$AJ$4:$AJ$200,'Unikke lister'!$AD$4:$AD$200,\"\",0)","v":"Facadevindue"},{"$f":"_xlfn.XLOOKUP(N7,'Unikke lister'!$AD$4:$AD$200,'Unikke lister'!$AH$4:$AH$200,\"\",0)/Bruttoareal/Betragtningstid","v":0.37863945578231295},{"$f":"_xlfn.XLOOKUP(N7,'Unikke lister'!$AD$4:$AD$200,'Unikke lister'!$AE$4:$AE$200,\"\",0)/1000","v":0.75240000000000007},null,null,3,{"$f":"_xlfn.XLOOKUP(S7,'Unikke lister'!$BD$4:$BD$300,'Unikke lister'!$AX$4:$AX$300,\"\",0)","v":"Vindspærre"},{"$f":"_xlfn.XLOOKUP(T7,'Unikke lister'!$AX$4:$AX$300,'Unikke lister'!$BB$4:$BB$300,\"\",0)/Bruttoareal/Betragtningstid","v":0.2717126530612245},{"$f":"_xlfn.XLOOKUP(T7,'Unikke lister'!$AX$4:$AX$300,'Unikke lister'!$AY$4:$AY$300,\"\",0)/1000","v":3.0671999999999997},null,null,3,{"$f":"_xlfn.XLOOKUP(Y7,'Unikke lister'!$BD$4:$BD$300,'Unikke lister'!$AX$4:$AX$300,\"\",0)","v":"Vindspærre"},{"$f":"_xlfn.XLOOKUP(T7,'Unikke lister'!$AX$4:$AX$300,'Unikke lister'!$BB$4:$BB$300,\"\",0)/Bruttoareal/Betragtningstid","v":0.2717126530612245},{"$f":"_xlfn.XLOOKUP(Z7,'Unikke lister'!$AX$4:$AX$300,'Unikke lister'!$AY$4:$AY$300,\"\",0)/1000","v":3.0671999999999997}]
[4,{"$f":"_xlfn.XLOOKUP(A8,'Unikke lister'!$G$4:$G$20,'Unikke lister'!$A$4:$A$20,\"\",0)","v":"Vand"},{"$f":"_xlfn.XLOOKUP(B8,'Unikke lister'!$A$4:$A$20,'Unikke lister'!$E$4:$E$20,\"\",0)/Bruttoareal/Betragtningstid","v":0.3015521606435374},{"$f":"_xlfn.XLOOKUP(B8,'Unikke lister'!$A$4:$A$20,'Unikke lister'!$B$4:$B$20,\"\",0)/1000","v":0.25900000000000001},null,null,4,{"$f":"_xlfn.XLOOKUP(G8,'Unikke lister'!$W$4:$W$100,'Unikke lister'!$Q$4:$Q$100,\"\",0)","v":"Ovenlys"},{"$f":"_xlfn.XLOOKUP(H8,'Unikke lister'!$Q$4:$Q$100,'Unikke lister'!$U$4:$U$100,\"\",0)/Bruttoareal/Betragtningstid","v":0.30378802721088438},{"$f":"_xlfn.XLOOKUP(H8,'Unikke lister'!$Q$4:$Q$100,'Unikke lister'!$R$4:$R$100,\"\",0)/1000","v":0.52871250000000003},null,null,4,{"$f":"_xlfn.XLOOKUP(M8,'Unikke lister'!$AJ$4:$AJ$200,'Unikke lister'!$AD$4:$AD$200,\"\",0)","v":"Varmepumpe"},{"$f":"_xlfn.XLOOKUP(N8,'Unikke lister'!$AD$4:$AD$200,'Unikke lister'!$AH$4:$AH$200,\"\",0)/Bruttoareal/Betragtningstid","v":0.36589611461224492},{"$f":"_xlfn.XLOOKUP(N8,'Unikke lister'!$AD$4:$AD$200,'Unikke lister'!$AE$4:$AE$200,\"\",0)/1000","v":0.30307999999999996},null,null,4,{"$f":"_xlfn.XLOOKUP(S8,'Unikke lister'!$BD$4:$BD$300,'Unikke lister'!$AX$4:$AX$300,\"\",0)","v":"Solceller, Sunpower"},{"$f":"_xlfn.XLOOKUP(T8,'Unikke lister'!$AX$4:$AX$300,'Unikke lister'!$BB$4:$BB$300,\"\",0)/Bruttoareal/Betragtningstid","v":0.22304837278911563},{"$f":"_xlfn.XLOOKUP(T8,'Unikke lister'!$AX$4:$AX$300,'Unikke lister'!$AY$4:$AY$300,\"\",0)/1000","v":0.2014},null,null,4,{"$f":"_xlfn.XLOOKUP(Y8,'Unikke lister'!$BD$4:$BD$300,'Unikke lister'!$AX$4:$AX$300,\"\",0)","v":"Solceller, Sunpower"},{"$f":"_xlfn.XLOOKUP(T8,'Unikke lister'!$AX$4:$AX$300,'Unikke lister'!$BB$4:$BB$300,\"\",0)/Bruttoareal/Betragtningstid","v":0.22304837278911563},{"$f":"_xlfn.XLOOKUP(Z8,'Unikke lister'!$AX$4:$AX$300,'Unikke lister'!$AY$4:$AY$300,\"\",0)/1000","v":0.2014}]
[5,{"$f":"_xlfn.XLOOKUP(A9,'Unikke lister'!$G$4:$G$20,'Unikke lister'!$A$4:$A$20,\"\",0)","v":"Varme"},{"$f":"_xlfn.XLOOKUP(B9,'Unikke lister'!$A$4:$A$20,'Unikke lister'!$E$4:$E$20,\"\",0)/Bruttoareal/Betragtningstid","v":0.23941757027824542},{"$f":"_xlfn.XLOOKUP(B9,'Unikke lister'!$A$4:$A$20,'Unikke lister'!$B$4:$B$20,\"\",0)/1000","v":0.35667750285429806},null,null,5,{"$f":"_xlfn.XLOOKUP(G9,'Unikke lister'!$W$4:$W$100,'Unikke lister'!$Q$4:$Q$100,\"\",0)","v":"VVB og buffertank"},{"$f":"_xlfn.XLOOKUP(H9,'Unikke lister'!$Q$4:$Q$100,'Unikke lister'!$U$4:$U$100,\"\",0)/Bruttoareal/Betragtningstid","v":0.28266288435374148},{"$f":"_xlfn.XLOOKUP(H9,'Unikke lister'!$Q$4:$Q$100,'Unikke lister'!$R$4:$R$100,\"\",0)/1000","v":0.22},null,null,5,{"$f":"_xlfn.XLOOKUP(M9,'Unikke lister'!$AJ$4:$AJ$200,'Unikke lister'!$AD$4:$AD$200,\"\",0)","v":"Solceller, Sunpower"},{"$f":"_xlfn.XLOOKUP(N9,'Unikke lister'!$AD$4:$AD$200,'Unikke lister'!$AH$4:$AH$200,\"\",0)/Bruttoareal/Betragtningstid","v":0.22304837278911563},{"$f":"_xlfn.XLOOKUP(N9,'Unikke lister'!$AD$4:$AD$200,'Unikke lister'!$AE$4:$AE$200,\"\",0)/1000","v":0.2014},null,null,5,{"$f":"_xlfn.XLOOKUP(S9,'Unikke lister'!$BD$4:$BD$300,'Unikke lister'!$AX$4:$AX$300,\"\",0)","v":"Zink-Magnesium tag"},{"$f":"_xlfn.XLOOKUP(T9,'Unikke lister'!$AX$4:$AX$300,'Unikke lister'!$BB$4:$BB$300,\"\",0)/Bruttoareal/Betragtningstid","v":0.21622589326530611},{"$f":"_xlfn.XLOOKUP(T9,'Unikke lister'!$AX$4:$AX$300,'Unikke lister'!$AY$4:$AY$300,\"\",0)/1000","v":0.61050000000000004},null,null,5,{"$f":"_xlfn.XLOOKUP(Y9,'Unikke lister'!$BD$4:$BD$300,'Unikke lister'!$AX$4:$AX$300,\"\",0)","v":"Zink-Magnesium tag"},{"$f":"_xlfn.XLOOKUP(T9,'Unikke lister'!$AX$4:$AX$300,'Unikke lister'!$BB$4:$BB$300,\"\",0)/Bruttoareal/Betragtningstid","v":0.21622589326530611},{"$f":"_xlfn.XLOOKUP(Z9,'Unikke lister'!$AX$4:$AX$300,'Unikke lister'!$AY$4:$AY$300,\"\",0)/1000","v":0.61050000000000004}]
[6,{"$f":"_xlfn.XLOOKUP(A10,'Unikke lister'!$G$4:$G$20,'Unikke lister'!$A$4:$A$20,\"\",0)","v":"El- og mekaniske anlæg"},{"$f":"_xlfn.XLOOKUP(B10,'Unikke lister'!$A$4:$A$20,'Unikke lister'!$E$4:$E$20,\"\",0)/Bruttoareal/Betragtningstid","v":0.22304837278911563},{"$f":"_xlfn.XLOOKUP(B10,'Unikke lister'!$A$4:$A$20,'Unikke lister'!$B$4:$B$20,\"\",0)/1000","v":0.2014},null,null,6,{"$f":"_xlfn.XLOOKUP(G10,'Unikke lister'!$W$4:$W$100,'Unikke lister'!$Q$4:$Q$100,\"\",0)","v":"Solceller"},{"$f":"_xlfn.XLOOKUP(H10,'Unikke lister'!$Q$4:$Q$100,'Unikke lister'!$U$4:$U$100,\"\",0)/Bruttoareal/Betragtningstid","v":0.22304837278911563},{"$f":"_xlfn.XLOOKUP(H10,'Unikke lister'!$Q$4:$Q$100,'Unikke lister'!$R$4:$R$100,\"\",0)/1000","v":0.2014},null,null,6,{"$f":"_xlfn.XLOOKUP(M10,'Unikke lister'!$AJ$4:$AJ$200,'Unikke lister'!$AD$4:$AD$200,\"\",0)","v":"Velux ovenlys"},{"$f":"_xlfn.XLOOKUP(N10,'Unikke lister'!$AD$4:$AD$200,'Unikke lister'!$AH$4:$AH$200,\"\",0)/Bruttoareal/Betragtningstid","v":0.19481387755102042},{"$f":"_xlfn.XLOOKUP(N10,'Unikke lister'!$AD$4:$AD$200,'Unikke lister'!$AE$4:$AE$200,\"\",0)/1000","v":0.39431250000000001},null,null,6,{"$f":"_xlfn.XLOOKUP(S10,'Unikke lister'!$BD$4:$BD$300,'Unikke lister'!$AX$4:$AX$300,\"\",0)","v":"Papirisolering"},{"$f":"_xlfn.XLOOKUP(T10,'Unikke lister'!$AX$4:$AX$300,'Unikke lister'!$BB$4:$BB$300,\"\",0)/Bruttoareal/Betragtningstid","v":0.20671529251700679},{"$f":"_xlfn.XLOOKUP(T10,'Unikke lister'!$AX$4:$AX$300,'Unikke lister'!$AY$4:$AY$300,\"\",0)/1000","v":4.9657699999999991},null,null,null,"Resterende byggevarer",{"$f":"AA4-SUM(AA5:AA9)","v":2.0601254048090891},{"$f":"AB4-SUM(AB5:AB9)","v":41.829153222854295}]
[7,{"$f":"_xlfn.XLOOKUP(A11,'Unikke lister'!$G$4:$G$20,'Unikke lister'!$A$4:$A$20,\"\",0)","v":"Terrændæk"},{"$f":"_xlfn.XLOOKUP(B11,'Unikke lister'!$A$4:$A$20,'Unikke lister'!$E$4:$E$20,\"\",0)/Bruttoareal/Betragtningstid","v":0.20729680734285716},{"$f":"_xlfn.XLOOKUP(B11,'Unikke lister'!$A$4:$A$20,'Unikke lister'!$B$4:$B$20,\"\",0)/1000","v":4.8952799999999996},null,null,7,{"$f":"_xlfn.XLOOKUP(G11,'Unikke lister'!$W$4:$W$100,'Unikke lister'!$Q$4:$Q$100,\"\",0)","v":"Terrændæk, trækassette"},{"$f":"_xlfn.XLOOKUP(H11,'Unikke lister'!$Q$4:$Q$100,'Unikke lister'!$U$4:$U$100,\"\",0)/Bruttoareal/Betragtningstid","v":0.20729680734285716},{"$f":"_xlfn.XLOOKUP(H11,'Unikke lister'!$Q$4:$Q$100,'Unikke lister'!$R$4:$R$100,\"\",0)/1000","v":4.8952799999999996},null,null,7,{"$f":"_xlfn.XLOOKUP(M11,'Unikke lister'!$AJ$4:$AJ$200,'Unikke lister'!$AD$4:$AD$200,\"\",0)","v":"Let trækassette, terræn"},{"$f":"_xlfn.XLOOKUP(N11,'Unikke lister'!$AD$4:$AD$200,'Unikke lister'!$AH$4:$AH$200,\"\",0)/Bruttoareal/Betragtningstid","v":0.15297032380952383},{"$f":"_xlfn.XLOOKUP(N11,'Unikke lister'!$AD$4:$AD$200,'Unikke lister'!$AE$4:$AE$200,\"\",0)/1000","v":3.7620800000000001},null,null,7,{"$f":"_xlfn.XLOOKUP(S11,'Unikke lister'!$BD$4:$BD$300,'Unikke lister'!$AX$4:$AX$300,\"\",0)","v":"Velux ovenlys"},{"$f":"_xlfn.XLOOKUP(T11,'Unikke lister'!$AX$4:$AX$300,'Unikke lister'!$BB$4:$BB$300,\"\",0)/Bruttoareal/Betragtningstid","v":0.19481387755102042},{"$f":"_xlfn.XLOOKUP(T11,'Unikke lister'!$AX$4:$AX$300,'Unikke lister'!$AY$4:$AY$300,\"\",0)/1000","v":0.39431250000000001}]
[8,{"$f":"_xlfn.XLOOKUP(A12,'Unikke lister'!$G$4:$G$20,'Unikke lister'!$A$4:$A$20,\"\",0)","v":"Dæk"},{"$f":"_xlfn.XLOOKUP(B12,'Unikke lister'!$A$4:$A$20,'Unikke lister'!$E$4:$E$20,\"\",0)/Bruttoareal/Betragtningstid","v":0.16331038510314275},{"$f":"_xlfn.XLOOKUP(B12,'Unikke lister'!$A$4:$A$20,'Unikke lister'!$B$4:$B$20,\"\",0)/1000","v":5.3430588000000006},null,null,8,{"$f":"_xlfn.XLOOKUP(G12,'Unikke lister'!$W$4:$W$100,'Unikke lister'!$Q$4:$Q$100,\"\",0)","v":"Etagedæk, bjælkelag"},{"$f":"_xlfn.XLOOKUP(H12,'Unikke lister'!$Q$4:$Q$100,'Unikke lister'!$U$4:$U$100,\"\",0)/Bruttoareal/Betragtningstid","v":0.16331038510314275},{"$f":"_xlfn.XLOOKUP(H12,'Unikke lister'!$Q$4:$Q$100,'Unikke lister'!$R$4:$R$100,\"\",0)/1000","v":5.3430588000000006},null,null,8,{"$f":"_xlfn.XLOOKUP(M12,'Unikke lister'!$AJ$4:$AJ$200,'Unikke lister'!$AD$4:$AD$200,\"\",0)","v":"Skruefundament"},{"$f":"_xlfn.XLOOKUP(N12,'Unikke lister'!$AD$4:$AD$200,'Unikke lister'!$AH$4:$AH$200,\"\",0)/Bruttoareal/Betragtningstid","v":0.11498408163265308},{"$f":"_xlfn.XLOOKUP(N12,'Unikke lister'!$AD$4:$AD$200,'Unikke lister'!$AE$4:$AE$200,\"\",0)/1000","v":0.75},null,null,8,{"$f":"_xlfn.XLOOKUP(S12,'Unikke lister'!$BD$4:$BD$300,'Unikke lister'!$AX$4:$AX$300,\"\",0)","v":"OSB plade"},{"$f":"_xlfn.XLOOKUP(T12,'Unikke lister'!$AX$4:$AX$300,'Unikke lister'!$BB$4:$BB$300,\"\",0)/Bruttoareal/Betragtningstid","v":0.18366122448979597},{"$f":"_xlfn.XLOOKUP(T12,'Unikke lister'!$AX$4:$AX$300,'Unikke lister'!$AY$4:$AY$300,\"\",0)/1000","v":3.1073400000000002}]
[9,{"$f":"_xlfn.XLOOKUP(A13,'Unikke lister'!$G$4:$G$20,'Unikke lister'!$A$4:$A$20,\"\",0)","v":"Indervægge"},{"$f":"_xlfn.XLOOKUP(B13,'Unikke lister'!$A$4:$A$20,'Unikke lister'!$E$4:$E$20,\"\",0)/Bruttoareal/Betragtningstid","v":0.15151600767180912},{"$f":"_xlfn.XLOOKUP(B13,'Unikke lister'!$A$4:$A$20,'Unikke lister'!$B$4:$B$20,\"\",0)/1000","v":3.3119280000000004},null,null,9,{"$f":"_xlfn.XLOOKUP(G13,'Unikke lister'!$W$4:$W$100,'Unikke lister'!$Q$4:$Q$100,\"\",0)","v":"Indervægge"},{"$f":"_xlfn.XLOOKUP(H13,'Unikke lister'!$Q$4:$Q$100,'Unikke lister'!$U$4:$U$100,\"\",0)/Bruttoareal/Betragtningstid","v":0.15151600767180912},{"$f":"_xlfn.XLOOKUP(H13,'Unikke lister'!$Q$4:$Q$100,'Unikke lister'!$R$4:$R$100,\"\",0)/1000","v":3.3119280000000004},null,null,9,{"$f":"_xlfn.XLOOKUP(M13,'Unikke lister'!$AJ$4:$AJ$200,'Unikke lister'!$AD$4:$AD$200,\"\",0)","v":"Etagedæk, 70 mm gulvopbygning"},{"$f":"_xlfn.XLOOKUP(N13,'Unikke lister'!$AD$4:$AD$200,'Unikke lister'!$AH$4:$AH$200,\"\",0)/Bruttoareal/Betragtningstid","v":0.1137582655673469},{"$f":"_xlfn.XLOOKUP(N13,'Unikke lister'!$AD$4:$AD$200,'Unikke lister'!$AE$4:$AE$200,\"\",0)/1000","v":2.9264399999999995},null,null,9,{"$f":"_xlfn.XLOOKUP(S13,'Unikke lister'!$BD$4:$BD$300,'Unikke lister'!$AX$4:$AX$300,\"\",0)","v":"Konstruktionstræ"},{"$f":"_xlfn.XLOOKUP(T13,'Unikke lister'!$AX$4:$AX$300,'Unikke lister'!$BB$4:$BB$300,\"\",0)/Bruttoareal/Betragtningstid","v":0.1765496426781237},{"$f":"_xlfn.XLOOKUP(T13,'Unikke lister'!$AX$4:$AX$300,'Unikke lister'!$AY$4:$AY$300,\"\",0)/1000","v":12.327578799999998}]
[10,{"$f":"_xlfn.XLOOKUP(A14,'Unikke lister'!$G$4:$G$20,'Unikke lister'!$A$4:$A$20,\"\",0)","v":"Fundamenter"},{"$f":"_xlfn.XLOOKUP(B14,'Unikke lister'!$A$4:$A$20,'Unikke lister'!$E$4:$E$20,\"\",0)/Bruttoareal/Betragtningstid","v":0.14127850868399325},{"$f":"_xlfn.XLOOKUP(B14,'Unikke lister'!$A$4:$A$20,'Unikke lister'!$B$4:$B$20,\"\",0)/1000","v":1.4424387199999997},null,null,10,{"$f":"_xlfn.XLOOKUP(G14,'Unikke lister'!$W$4:$W$100,'Unikke lister'!$Q$4:$Q$100,\"\",0)","v":"Skruefundament"},{"$f":"_xlfn.XLOOKUP(H14,'Unikke lister'!$Q$4:$Q$100,'Unikke lister'!$U$4:$U$100,\"\",0)/Bruttoareal/Betragtningstid","v":0.14127850868399325},{"$f":"_xlfn.XLOOKUP(H14,'Unikke lister'!$Q$4:$Q$100,'Unikke lister'!$R$4:$R$100,\"\",0)/1000","v":1.4424387199999997},null,null,10,{"$f":"_xlfn.XLOOKUP(M14,'Unikke lister'!$AJ$4:$AJ$200,'Unikke lister'!$AD$4:$AD$200,\"\",0)","v":"Velux fladt ovenlys"},{"$f":"_xlfn.XLOOKUP(N14,'Unikke lister'!$AD$4:$AD$200,'Unikke lister'!$AH$4:$AH$200,\"\",0)/Bruttoareal/Betragtningstid","v":0.10897414965986395},{"$f":"_xlfn.XLOOKUP(N14,'Unikke lister'!$AD$4:$AD$200,'Unikke lister'!$AE$4:$AE$200,\"\",0)/1000","v":0.13440000000000002},null,null,10,{"$f":"_xlfn.XLOOKUP(S14,'Unikke lister'!$BD$4:$BD$300,'Unikke lister'!$AX$4:$AX$300,\"\",0)","v":"Hunton Undertag"},{"$f":"_xlfn.XLOOKUP(T14,'Unikke lister'!$AX$4:$AX$300,'Unikke lister'!$BB$4:$BB$300,\"\",0)/Bruttoareal/Betragtningstid","v":0.1688268469387755},{"$f":"_xlfn.XLOOKUP(T14,'Unikke lister'!$AX$4:$AX$300,'Unikke lister'!$AY$4:$AY$300,\"\",0)/1000","v":0.70973399999999998}]
[11,{"$f":"_xlfn.XLOOKUP(A15,'Unikke lister'!$G$4:$G$20,'Unikke lister'!$A$4:$A$20,\"\",0)","v":"Afløb"},{"$f":"_xlfn.XLOOKUP(B15,'Unikke lister'!$A$4:$A$20,'Unikke lister'!$E$4:$E$20,\"\",0)/Bruttoareal/Betragtningstid","v":6.6800282000000002E-2},{"$f":"_xlfn.XLOOKUP(B15,'Unikke lister'!$A$4:$A$20,'Unikke lister'!$B$4:$B$20,\"\",0)/1000","v":6.8925E-2},null,null,null,"Resterende bygningsdele",{"$f":"I4-SUM(I5:I14)","v":0.35334026154183817},{"$f":"J4-SUM(J5:J14)","v":1.0206985028542945},null,null,null,"Resterende konstruktioner",{"$f":"O4-SUM(O5:O14)","v":0.71470678004159893},{"$f":"P4-SUM(P5:P14)","v":12.927220722854287},null,null,null,"Resterende byggevarer",{"$f":"U4-SUM(U5:U14)","v":1.1295585206343666},{"$f":"V4-SUM(V5:V14)","v":20.324417922854291}]
[12,{"$f":"_xlfn.XLOOKUP(A16,'Unikke lister'!$G$4:$G$20,'Unikke lister'!$A$4:$A$20,\"\",0)","v":"Trapper og ramper"},{"$f":"_xlfn.XLOOKUP(B16,'Unikke lister'!$A$4:$A$20,'Unikke lister'!$E$4:$E$20,\"\",0)/Bruttoareal/Betragtningstid","v":9.699606158252775E-3},{"$f":"_xlfn.XLOOKUP(B16,'Unikke lister'!$A$4:$A$20,'Unikke lister'!$B$4:$B$20,\"\",0)/1000","v":0.27429999999999999}]
[13,{"$f":"_xlfn.XLOOKUP(A17,'Unikke lister'!$G$4:$G$20,'Unikke lister'!$A$4:$A$20,\"\",0)","v":"Søjler og bjælker"},{"$f":"_xlfn.XLOOKUP(B17,'Unikke lister'!$A$4:$A$20,'Unikke lister'!$E$4:$E$20,\"\",0)/Bruttoareal/Betragtningstid","v":1.8819047619047632E-3},{"$f":"_xlfn.XLOOKUP(B17,'Unikke lister'!$A$4:$A$20,'Unikke lister'!$B$4:$B$20,\"\",0)/1000","v":5.1999999999999998E-2}]
[14,{"$f":"_xlfn.XLOOKUP(A18,'Unikke lister'!$G$4:$G$20,'Unikke lister'!$A$4:$A$20,\"\",0)","v":"Ventilation og køl "},{"$f":"_xlfn.XLOOKUP(B18,'Unikke lister'!$A$4:$A$20,'Unikke lister'!$E$4:$E$20,\"\",0)/Bruttoareal/Betragtningstid","v":6.325859699659864E-4},{"$f":"_xlfn.XLOOKUP(B18,'Unikke lister'!$A$4:$A$20,'Unikke lister'!$B$4:$B$20,\"\",0)/1000","v":1.5249999999999999E-3}]

{"sheet":"Data","index":9,"n_rows":144,"n_cols":28,"rows_kept":144,"cut":false,"hidden":false,"merged":[]}
["Gruppe","Undergruppe","Bygningsdel","Konstruktion","Byggevare","Indtastet mængde","Column4","Beregnet mængde","Column6","Vægt","Column8","Udskiftninger ","Kilde","Medregnet","Levetid","Usikkerhedsfaktor","GWP ex_c3","GWP ex_c4","GWP ex_d","GWP a1_3","GWP a4","GWP a5","GWP b4","GWP b6","GWP c3","GWP c4","GWP d","GWP sum"]
["Afløb","Faldstammer","Afløbsrør","Afløbsrør, PP","Rør, Kloakrør PP",1.5,"kg/m",37.5,"kg",37.5,"kg",1,"GenDk",true,30,1,0,0,0,98.244,0,0,227.78550000000001,0,129.54150000000001,0,-127.91925000000001,455.57100000000003]
["Afløb","Nedløb fra tag","Tagrende","Nedløbsrør ","Stål, valsede profiler og plader",1.25,"kg/m",7.5,"kg",7.5,"kg",0,"GenDk",true,60,1,0,0,0,8.4375,0,0,0,0,1.383E-2,0,-3.1004999999999998,8.4513300000000005]
["Afløb","Nedløb fra tag","Tagrende","Tagrende","Stål, valsede profiler og plader",1.45,"kg/m",23.925000000000001,"kg",23.925000000000001,"kg",0,"GenDk",true,60,1,0,0,0,26.915624999999999,0,0,0,0,4.4117700000000003E-2,0,-9.8905949999999994,26.9597427]
["Dæk","Etagedæk","Etagedæk, bjælkelag","Etagedæk 1. sal, 270 mm bjælkelag","Fastgørelsesmidler/skruer i galvaniseret stål",0.3,"kg/m²",12.03,"kg",12.03,"kg",0,"GenDk",true,100,1,0,0,0,42.766770299999997,0,0,0,0,0,8.205302099999999E-3,-21.7817586,42.7749756021]
["Dæk","Etagedæk","Etagedæk, bjælkelag","Etagedæk 1. sal, 270 mm bjælkelag","Savede og tørrede konstruktionstræprodukter af fyr og gran, Fobrænding",3.4000000000000002E-2,"m³/m²",1.3633999999999999,"m³",621.71040000000005,"kg",0,"EPDDanmark",true,100,1,0,0,0,-927.11200000000008,0,0,0,0,992.55520000000001,0,-505.82139999999998,65.443199999999933]
["Dæk","Etagedæk","Etagedæk, bjælkelag","Etagedæk 1. sal, 270 mm bjælkelag","Savede og tørrede konstruktionstræprodukter af fyr og gran, Fobrænding",2.4E-2,"m³/m²",0.96240000000000003,"m³",438.8544,"kg",0,"EPDDanmark",true,100,1,0,0,0,-654.43200000000002,0,0,0,0,700.6271999999999,0,-357.05040000000002,46.195199999999893]
["Dæk","Etagedæk","Etagedæk, bjælkelag","Etagedæk 2. sal, 230 mm bjælkelag","Fastgørelsesmidler/skruer i galvaniseret stål",0.3,"kg/m²",19.8,"kg",19.8,"kg",0,"GenDk",true,100,1,0,0,0,70.389197999999993,0,0,0,0,0,1.3504986E-2,-35.850276000000001,70.402702985999994]
["Dæk","Etagedæk","Etagedæk, bjælkelag","Etagedæk 2. sal, 230 mm bjælkelag","Savede og tørrede konstruktionstræprodukter af fyr og gran, Fobrænding",4.3999999999999997E-2,"m³/m²",2.9039999999999999,"m³",1324.2239999999999,"kg",0,"EPDDanmark",true,100,1,0,0,0,-1974.72,0,0,0,0,2114.1120000000001,0,-1077.384,139.3919999999996]
["Dæk","Etagedæk","Etagedæk, bjælkelag","Etagedæk, 70 mm gulvopbygning","Fermacell fiberplade 12,5 mm",1,"m²/m²",66,"m²",973.5,"kg",0,"User",true,60,1,0,0,0,75.239999999999995,0,0,0,0,0,13.2799029,0,88.519902899999991]
["Dæk","Etagedæk","Etagedæk, bjælkelag","Etagedæk, 70 mm gulvopbygning","Trinlydsdug - Scan Underlay",1,"m²/m²",66,"m²",69.3,"kg",0,"User",true,60,1,0,0,0,33.725999999999999,0,0,0,0,0,0.94534901999999998,0,34.671349020000001]
["Dæk","Etagedæk","Etagedæk, bjælkelag","Etagedæk, 70 mm gulvopbygning","Trægulv 14 mm ask - Tarkett Sverige",1,"m²/m²",66,"m²",521.4,"kg",0,"User",true,60,1,0,0,0,-494.34,0,0,0,0,0,798.5999999999998,0,304.25999999999982]
["Dæk","Etagedæk","Etagedæk, bjælkelag","Etagedæk, 70 mm gulvopbygning","WISA Gran krydsfiner, ubehandlet, Fobrænding",1.7999999999999999E-2,"m³/m²",1.1879999999999999,"m³",570.24,"kg",0,"EPDDanmark",true,60,1,0,0,0,-711.61199999999997,0,0,0,0,882.68399999999997,0,-464.50799999999998,171.072]
["Dæk","Etagedæk","Etagedæk, bjælkelag","Etagedæk, 70 mm gulvopbygning","WISA Gran krydsfiner, ubehandlet, Fobrænding",2.5000000000000001E-2,"m³/m²",1.65,"m³",792.00000000000011,"kg",0,"EPDDanmark",true,60,1,0,0,0,-988.35000000000014,0,0,0,0,1225.95,0,-645.15000000000009,237.59999999999991]
["El- og mekaniske anlæg","Energiproduktion","Solceller","Solceller, Sunpower","Solceller, Sunpower",1,"m²/m²",10.6,"m²",201.4,"kg",1,"User",true,30,1,0,0,0,818.32,0,0,819.70276999999999,0,1.3673999999999999,1.537E-2,-661.43999999999994,1639.40554]
["Fundamenter","Punktfundament","Skruefundament","Krinner V114x5-M24","Stål, valsede profiler og plader",7,"kg/stk.",112,"kg",112,"kg",0,"GenDk",true,120,1,0,0,0,126,0,0,0,0,0.20652799999999999,0,-46.300800000000002,126.20652800000001]
["Fundamenter","Punktfundament","Skruefundament","Krinner V114x5x2000","Stål, valsede profiler og plader",29,"kg/stk.",464,"kg",464,"kg",0,"GenDk",true,120,1,0,0,0,522,0,0,0,0,0.85561600000000004,0,-191.8176,522.85561600000005]
["Fundamenter","Punktfundament","Skruefundament","Krinner V140x6,3-M24","Stål, valsede profiler og plader",10,"kg/stk.",30,"kg",30,"kg",0,"GenDk",true,120,1,0,0,0,33.75,0,0,0,0,5.5320000000000008E-2,0,-12.401999999999999,33.805320000000002]
["Fundamenter","Punktfundament","Skruefundament","Krinner V140x6,3x2000 ","Stål, valsede profiler og plader",48,"kg/stk.",144,"kg",144,"kg",0,"GenDk",true,120,1,0,0,0,162,0,0,0,0,0.26553599999999999,0,-59.529600000000002,162.265536]
["Fundamenter","Punktfundament","Skruefundament","Rem 200x185, limtræ","Fastgørelsesmidler/skruer i galvaniseret stål",8.6209999999999995E-2,"kg/m",1.3793599999999999,"kg",1.3793599999999999,"kg",0,"GenDk",true,100,1,0,0,0,4.9036385935999993,0,0,0,0,0,9.4082007519999996E-4,-2.4974968031999998,4.904579413675199]
["Fundamenter","Punktfundament","Skruefundament","Rem 200x185, limtræ","Limtræs-produkter af fyr og gran, Fobrænding",3.6999999999999998E-2,"m³/m",0.59199999999999997,"m³",296,"kg",0,"EPDDanmark",true,100,1,0,0,0,-361.12,0,0,0,0,439.85599999999999,0,-233.84,78.73599999999999]
["Fundamenter","Punktfundament","Skruefundament","Rem 266x185, limtræ","Fastgørelsesmidler/skruer i galvaniseret stål",8.6209999999999995E-2,"kg/m",1.3793599999999999,"kg",1.3793599999999999,"kg",0,"GenDk",true,100,1,0,0,0,4.9036385935999993,0,0,0,0,0,9.4082007519999996E-4,-2.4974968031999998,4.904579413675199]
["Fundamenter","Punktfundament","Skruefundament","Rem 266x185, limtræ","Limtræs-produkter af fyr og gran, Fobrænding",4.9209999999999997E-2,"m³/m",0.78735999999999995,"m³",393.67999999999989,"kg",0,"EPDDanmark",true,100,1,0,0,0,-480.28960000000001,0,0,0,0,585.00847999999996,0,-311.00720000000001,104.71888]
["Indervægge","Bærende indervægge","Indervægge","100 mm indervæg, fibergips","Fermacell fiberplade 12,5 mm",1.2,"m²/m²",30,"m²",442.5,"kg",0,"User",true,50,1,0,0,0,34.200000000000003,0,0,0,0,0,6.0363195000000003,0,40.236319499999993]
["Indervægge","Bærende indervægge","Indervægge","100 mm indervæg, fibergips","Fermacell fiberplade 12,5 mm",1.2,"kg/m²",2.0338983050847461,"m²",30,"kg",0,"User",true,50,1,0,0,0,2.31864406779661,0,0,0,0,0,0.40924199999999999,0,2.7278860677966099]
["Indervægge","Bærende indervægge","Indervægge","100 mm indervæg, fibergips","Savede og tørrede konstruktionstræprodukter af fyr og gran, Fobrænding",1.0500000000000001E-2,"m³/m²",0.26250000000000001,"m³",119.7,"kg",0,"EPDDanmark",true,100,1,0,0,0,-178.5,0,0,0,0,191.1,0,-97.387500000000003,12.599999999999991]
["Indervægge","Bærende indervægge","Indervægge","100 mm indervæg, fibergips","Træfiberisolering (bats), kl. 38 - Hunton",5.9499999999999997E-2,"m³/m²",1.4875,"m³",74.374999999999986,"kg",0,"User",true,100,1,0,0,0,-93.117499999999993,0,0,0,0,114.68625,9.743125E-3,-7.9134999999999991,21.57849312499998]
["Indervægge","Bærende indervægge","Indervægge","100 mm indervæg, krydsfiner","Savede og tørrede konstruktionstræprodukter af fyr og gran, Fobrænding",1.0500000000000001E-2,"m³/m²",0.38850000000000001,"m³",177.15600000000001,"kg",0,"EPDDanmark",true,100,1,0,0,0,-264.18,0,0,0,0,282.82799999999997,0,-144.1335,18.648000000000021]
["Indervægge","Bærende indervægge","Indervægge","100 mm indervæg, krydsfiner","Træfiberisolering (bats), kl. 38 - Hunton",5.9499999999999997E-2,"m³/m²",2.2014999999999998,"m³",110.075,"kg",0,"User",true,100,1,0,0,0,-137.81389999999999,0,0,0,0,169.73564999999999,1.4419825000000001E-2,-11.711980000000001,31.936169824999979]
["Indervægge","Bærende indervægge","Indervægge","100 mm indervæg, krydsfiner","WISA Gran krydsfiner, ubehandlet, Fobrænding",1.4999999999999999E-2,"m³/m²",0.55499999999999994,"m³",266.39999999999998,"kg",1,"EPDDanmark",true,30,1,0,0,0,-332.44499999999988,0,0,79.920000000000016,0,412.36500000000001,0,-434.00999999999988,159.84]
["Indervægge","Bærende indervægge","Indervægge","100 mm indervæg, krydsfiner","WISA Gran krydsfiner, ubehandlet, Fobrænding",1.4999999999999999E-2,"m³/m²",0.55499999999999994,"m³",266.39999999999998,"kg",1,"EPDDanmark",true,30,1,0,0,0,-332.44499999999988,0,0,79.920000000000016,0,412.36500000000001,0,-434.00999999999988,159.84]
["Indervægge","Bærende indervægge","Indervægge","100 mm indervæg, krydsfiner og fibergips","Fermacell fiberplade 12,5 mm",1.2,"m²/m²",6,"m²",88.5,"kg",0,"User",true,50,1,0,0,0,6.84,0,0,0,0,0,1.2072639000000001,0,8.0472639000000008]
["Indervægge","Bærende indervægge","Indervægge","100 mm indervæg, krydsfiner og fibergips","Savede og tørrede konstruktionstræprodukter af fyr og gran, Fobrænding",1.0500000000000001E-2,"m³/m²",5.2499999999999998E-2,"m³",23.94,"kg",0,"EPDDanmark",true,100,1,0,0,0,-35.700000000000003,0,0,0,0,38.22,0,-19.477499999999999,2.519999999999996]
["Indervægge","Bærende indervægge","Indervægge","100 mm indervæg, krydsfiner og fibergips","Træfiberisolering (bats), kl. 38 - Hunton",5.9499999999999997E-2,"m³/m²",0.29749999999999999,"m³",14.875,"kg",0,"User",true,100,1,0,0,0,-18.6235,0,0,0,0,22.937249999999999,1.9486250000000001E-3,-1.5827,4.3156986249999987]
["Indervægge","Bærende indervægge","Indervægge","100 mm indervæg, krydsfiner og fibergips","WISA Gran krydsfiner, ubehandlet, Fobrænding",1.4999999999999999E-2,"m³/m²",7.4999999999999997E-2,"m³",36,"kg",1,"EPDDanmark",true,30,1,0,0,0,-44.924999999999997,0,0,10.8,0,55.725000000000001,0,-58.65,21.600000000000009]
["Indervægge","Bærende indervægge","Indervægge","110 mm indervæg mod bad, krydsfiner og fibergips med klinker ","Fermacell fiberplade 12,5 mm",1.2,"m²/m²",7.1999999999999993,"m²",106.2,"kg",0,"User",true,60,1,0,0,0,8.2079999999999984,0,0,0,0,0,1.44871668,0,9.6567166799999988]
["Indervægge","Bærende indervægge","Indervægge","110 mm indervæg mod bad, krydsfiner og fibergips med klinker ","Keramikfliser, glaseret",1,"m²/m²",6,"m²",120,"kg",0,"GenDk",true,80,1,0,0,0,37.078139999999998,0,0,0,0,0.88046400000000014,0,-0.24647759999999999,37.958604000000001]
["Indervægge","Bærende indervægge","Indervægge","110 mm indervæg mod bad, krydsfiner og fibergips med klinker ","Mørtel, fliseklæber",3.1,"kg/m²",18.600000000000001,"kg",18.600000000000001,"kg",0,"GenDk",true,80,1,0,0,0,6.4547952000000004,0,0,0,0,0,0.30447642000000003,-5.3107650000000013E-2,6.7592716200000007]
["Indervægge","Bærende indervægge","Indervægge","110 mm indervæg mod bad, krydsfiner og fibergips med klinker ","Savede og tørrede konstruktionstræprodukter af fyr og gran, Fobrænding",1.0500000000000001E-2,"m³/m²",6.3E-2,"m³",28.728000000000002,"kg",0,"EPDDanmark",true,100,1,0,0,0,-42.84,0,0,0,0,45.863999999999997,0,-23.373000000000001,3.0239999999999938]
["Indervægge","Bærende indervægge","Indervægge","110 mm indervæg mod bad, krydsfiner og fibergips med klinker ","Træfiberisolering (bats), kl. 38 - Hunton",5.9499999999999997E-2,"m³/m²",0.35699999999999998,"m³",17.850000000000001,"kg",0,"User",true,100,1,0,0,0,-22.348199999999999,0,0,0,0,27.524699999999999,2.3383499999999999E-3,-1.89924,5.1788383499999968]
["Indervægge","Bærende indervægge","Indervægge","110 mm indervæg mod bad, krydsfiner og fibergips med klinker ","Vandtætningsmembran, flydende",1.2,"kg/m²",7.1999999999999993,"kg",7.1999999999999993,"kg",0,"GenDk",true,50,1,0,0,0,7.992,0,0,0,0,1.9173599999999999E-2,0,0,8.0111735999999993]
["Indervægge","Bærende indervægge","Indervægge","110 mm indervæg mod bad, krydsfiner og fibergips med klinker ","WISA Gran krydsfiner, ubehandlet, Fobrænding",1.4999999999999999E-2,"m³/m²",0.09,"m³",43.2,"kg",1,"EPDDanmark",true,30,1,0,0,0,-53.91,0,0,12.96000000000001,0,66.87,0,-70.38,25.920000000000019]
["Indervægge","Bærende indervægge","Indervægge","150 mm indervæg mod bad, krydsfiner og fibergips med klinker","Fermacell fiberplade 12,5 mm",1.2,"m²/m²",7.1999999999999993,"m²",106.2,"kg",0,"User",true,60,1,0,0,0,8.2079999999999984,0,0,0,0,0,1.44871668,0,9.6567166799999988]
["Indervægge","Bærende indervægge","Indervægge","150 mm indervæg mod bad, krydsfiner og fibergips med klinker","Keramikfliser, glaseret",1,"m²/m²",6,"m²",120,"kg",0,"GenDk",true,80,1,0,0,0,37.078139999999998,0,0,0,0,0.88046400000000014,0,-0.24647759999999999,37.958604000000001]
["Indervægge","Bærende indervægge","Indervægge","150 mm indervæg mod bad, krydsfiner og fibergips med klinker","Mørtel, fliseklæber",3.1,"kg/m²",18.600000000000001,"kg",18.600000000000001,"kg",0,"GenDk",true,80,1,0,0,0,6.4547952000000004,0,0,0,0,0,0.30447642000000003,-5.3107650000000013E-2,6.7592716200000007]
["Indervægge","Bærende indervægge","Indervægge","150 mm indervæg mod bad, krydsfiner og fibergips med klinker","Savede og tørrede konstruktionstræprodukter af fyr og gran, Fobrænding",1.6500000000000001E-2,"m³/m²",9.9000000000000005E-2,"m³",45.144000000000013,"kg",0,"EPDDanmark",true,100,1,0,0,0,-67.320000000000007,0,0,0,0,72.072000000000003,0,-36.728999999999999,4.7519999999999953]
["Indervægge","Bærende indervægge","Indervægge","150 mm indervæg mod bad, krydsfiner og fibergips med klinker","Træfiberisolering (bats), kl. 38 - Hunton",9.35E-2,"m³/m²",0.56099999999999994,"m³",28.05,"kg",0,"User",true,100,1,0,0,0,-35.118600000000001,0,0,0,0,43.253099999999989,3.67455E-3,-2.9845199999999998,8.138174549999988]
["Indervægge","Bærende indervægge","Indervægge","150 mm indervæg mod bad, krydsfiner og fibergips med klinker","Vandtætningsmembran, flydende",1.2,"kg/m²",7.1999999999999993,"kg",7.1999999999999993,"kg",0,"GenDk",true,50,1,0,0,0,7.992,0,0,0,0,1.9173599999999999E-2,0,0,8.0111735999999993]
["Indervægge","Bærende indervægge","Indervægge","150 mm indervæg mod bad, krydsfiner og fibergips med klinker","WISA Gran krydsfiner, ubehandlet, Fobrænding",1.4999999999999999E-2,"m³/m²",0.09,"m³",43.2,"kg",1,"EPDDanmark",true,30,1,0,0,0,-53.91,0,0,12.96000000000001,0,66.87,0,-70.38,25.920000000000019]
["Indervægge","Bærende indervægge","Indervægge","45 mm indervæg mod skakt, krydsfiner","Savede og tørrede konstruktionstræprodukter af fyr og gran, Fobrænding",5.0000000000000001E-3,"m³/m²",0.11,"m³",50.16,"kg",0,"EPDDanmark",true,100,1,0,0,0,-74.8,0,0,0,0,80.08,0,-40.81,5.2800000000000011]
["Indervægge","Bærende indervægge","Indervægge","45 mm indervæg mod skakt, krydsfiner","WISA Gran krydsfiner, ubehandlet, Fobrænding",0.03,"m³/m²",0.65999999999999992,"m³",316.8,"kg",1,"EPDDanmark",true,30,1,0,0,0,-395.34,0,0,95.039999999999964,0,490.37999999999988,0,-516.11999999999989,190.0799999999999]
["Indervægge","Bærende indervægge","Indervægge","60 mm skunkvægge, krydsfiner","Savede og tørrede konstruktionstræprodukter af fyr og gran, Fobrænding",7.0000000000000001E-3,"m³/m²",0.14000000000000001,"m³",63.84,"kg",0,"EPDDanmark",true,100,1,0,0,0,-95.2,0,0,0,0,101.92,0,-51.94,6.7200000000000131]
["Indervægge","Bærende indervægge","Indervægge","60 mm skunkvægge, krydsfiner","WISA Gran krydsfiner, ubehandlet, Fobrænding",1.4999999999999999E-2,"m³/m²",0.3,"m³",144,"kg",1,"EPDDanmark",true,30,1,0,0,0,-179.7,0,0,43.200000000000017,0,222.9,0,-234.6,86.400000000000034]
["Indervægge","Bærende indervægge","Indervægge","80 mm indervæg, krydsfiner","Savede og tørrede konstruktionstræprodukter af fyr og gran, Fobrænding",7.4999999999999997E-3,"m³/m²",2.2499999999999999E-2,"m³",10.26,"kg",0,"EPDDanmark",true,100,1,0,0,0,-15.3,0,0,0,0,16.38,0,-8.3475000000000001,1.08]
["Indervægge","Bærende indervægge","Indervægge","80 mm indervæg, krydsfiner","Træfiberisolering (bats), kl. 38 - Hunton",4.2500000000000003E-2,"m³/m²",0.1275,"m³",6.375,"kg",0,"User",true,100,1,0,0,0,-7.9814999999999996,0,0,0,0,9.8302499999999995,8.3512500000000004E-4,-0.67830000000000001,1.8495851249999991]
["Indervægge","Bærende indervægge","Indervægge","80 mm indervæg, krydsfiner","WISA Gran krydsfiner, ubehandlet, Fobrænding",1.4999999999999999E-2,"m³/m²",4.4999999999999998E-2,"m³",21.6,"kg",1,"EPDDanmark",true,30,1,0,0,0,-26.954999999999998,0,0,6.480000000000004,0,33.435000000000002,0,-35.19,12.96000000000001]
["Indervægge","Bærende indervægge","Indervægge","80 mm indervæg, krydsfiner","WISA Gran krydsfiner, ubehandlet, Fobrænding",1.4999999999999999E-2,"m³/m²",4.4999999999999998E-2,"m³",21.6,"kg",1,"EPDDanmark",true,30,1,0,0,0,-26.954999999999998,0,0,6.480000000000004,0,33.435000000000002,0,-35.19,12.96000000000001]
["Indervægge","Bærende indervægge","Indervægge","Klinkebeklædning på badeværelse","Keramikfliser, glaseret",1,"m²/m²",13,"m²",260,"kg",0,"GenDk",true,80,1,0,0,0,80.335970000000003,0,0,0,0,1.907672,0,-0.53403480000000003,82.243642000000008]
["Indervægge","Bærende indervægge","Indervægge","Klinkebeklædning på badeværelse","Mørtel, fliseklæber",3.2,"kg/m²",41.6,"kg",41.6,"kg",0,"GenDk",true,80,1,0,0,0,14.436531199999999,0,0,0,0,0,0.68097952000000006,-0.11877840000000001,15.11751072]
["Indervægge","Bærende indervægge","Indervægge","Klinkebeklædning på badeværelse","Vandtætningsmembran, flydende",1.2,"kg/m²",15.6,"kg",15.6,"kg",0,"GenDk",true,50,1,0,0,0,17.315999999999999,0,0,0,0,4.1542799999999998E-2,0,0,17.357542800000001]
["Søjler og bjælker","Søjler","Træsøjle","Limtræssøjle 140 x 140 mm","Limtræs-produkter af fyr og gran, Fobrænding",5.1999999999999998E-2,"m³/stk.",0.104,"m³",52,"kg",0,"EPDDanmark",true,120,1,0,0,0,-63.44,0,0,0,0,77.272000000000006,0,-41.080000000000013,13.83200000000001]
["Tage","Tage","Tag, trækassette","Tagkassette, ståltag","Asfaltimprægneret porøs træfiberplade, 18 mm - Hunton Undertag",1.39,"m²/m²",154.29,"m²",709.73399999999992,"kg",1,"User",true,40,1,0,0,0,-800.76510000000007,0,0,620.43866249999996,0,1421.0109,0.19286249999999999,-44.0405376,1240.8773249999999]
["Tage","Tage","Tag, trækassette","Tagkassette, ståltag","Dampspærre PE (tykkelse 0,0002 m)",1,"m²/m²",111,"m²",22.2,"kg",1,"GenDk",true,40,1,0,0,0,44.333843999999999,0,0,106.044405,0,61.710561000000013,0,-60.930563999999997,212.08881]
["Tage","Tage","Tag, trækassette","Tagkassette, ståltag","Fermacell fiberplade 12,5 mm",2,"m²/m²",222,"m²",3274.5,"kg",0,"User",true,60,1,0,0,0,253.08,0,0,0,0,0,44.668764299999999,0,297.7487643]
["Tage","Tage","Tag, trækassette","Tagkassette, ståltag","Galvaniseret stålplade - Plannja",5.5,"kg/m²",610.5,"kg",610.5,"kg",0,"User",true,50,1,0,0,0,1587.3,0,0,0,0,1.4835149999999999,0.47680050000000002,-860.80499999999995,1589.2603154999999]
["Tage","Tage","Tag, trækassette","Tagkassette, ståltag","OSB2 Unsanded, Kronospan",1.7999999999999999E-2,"m³/m²",1.998,"m³",1218.78,"kg",0,"User",true,120,1,0,0,0,-1648.35,0,0,0,0,2177.8200000000002,0,-116.4834,529.47000000000025]
["Tage","Tage","Tag, trækassette","Tagkassette, ståltag","Papirisolering kl 37 - ISOCELL",13.6,"kg/m²",1509.6,"kg",1509.6,"kg",1,"User",true,40,1,0,0,0,-1856.808,0,0,332.11199999999991,0,2188.92,0,-1349.5824,664.22399999999971]
["Tage","Tage","Tag, trækassette","Tagkassette, ståltag","Papirisolering kl 37 - ISOCELL",1.8,"kg/m²",199.8,"kg",199.8,"kg",1,"User",true,40,1,0,0,0,-245.75399999999999,0,0,43.95599999999996,0,289.70999999999998,0,-178.62119999999999,87.911999999999921]
["Tage","Tage","Tag, trækassette","Tagkassette, ståltag","Savede og tørrede konstruktionstræprodukter af fyr og gran, Fobrænding",7.0000000000000001E-3,"m³/m²",0.77700000000000002,"m³",354.31200000000001,"kg",0,"EPDDanmark",true,120,1,0,0,0,-528.36,0,0,0,0,565.65600000000006,0,-288.267,37.296000000000049]
["Tage","Tage","Tag, trækassette","Tagkassette, ståltag","Savede og tørrede konstruktionstræprodukter af fyr og gran, Fobrænding",2E-3,"kg/m²",4.8684210526315792E-4,"m³",0.222,"kg",0,"EPDDanmark",true,120,1,0,0,0,-0.33105263157894732,0,0,0,0,0.35442105263157891,0,-0.18061842105263151,2.3368421052631538E-2]
["Tage","Tage","Tag, trækassette","Tagkassette, ståltag","Savede og tørrede konstruktionstræprodukter af fyr og gran, Fobrænding",8.0000000000000002E-3,"m³/m²",0.88800000000000001,"m³",404.928,"kg",0,"EPDDanmark",true,120,1,0,0,0,-603.84,0,0,0,0,646.46399999999994,0,-329.44799999999998,42.62399999999991]
["Tage","Tage","Tag, trækassette","Tagkassette, ståltag","Savede og tørrede konstruktionstræprodukter af fyr og gran, Fobrænding",4.3999999999999997E-2,"m³/m²",4.8839999999999986,"m³",2227.1039999999998,"kg",0,"EPDDanmark",true,120,1,0,0,0,-3321.119999999999,0,0,0,0,3555.5520000000001,0,-1811.9639999999999,234.43200000000019]
["Tage","Tage","Tag, trækassette","Tagkassette, ståltag","Savede og tørrede konstruktionstræprodukter af fyr og gran, Fobrænding",7.0000000000000001E-3,"m³/m²",0.77700000000000002,"m³",354.31200000000001,"kg",0,"EPDDanmark",true,120,1,0,0,0,-528.36,0,0,0,0,565.65600000000006,0,-288.267,37.296000000000049]
["Tage","Tage","Tag, trækassette","Tagkassette, tagpap","Dampspærre PE (tykkelse 0,0002 m)",1,"m²/m²",15,"m²",3,"kg",1,"GenDk",true,40,1,0,0,0,5.9910600000000001,0,0,14.330325,0,8.3392649999999993,0,-8.23386,28.66065]
["Tage","Tage","Tag, trækassette","Tagkassette, tagpap","Derbigum NT",1,"m²/m²",15,"m²",132.15,"kg",2,"EPDDanmark",true,20,1,0,0,0,46.8,0,0,102.96303,0,4.68,1.5150000000000001E-3,-19.934999999999999,154.44454500000001]
["Tage","Tage","Tag, trækassette","Tagkassette, tagpap","Fermacell fiberplade 12,5 mm",2,"m²/m²",30,"m²",442.5,"kg",0,"User",true,60,1,0,0,0,34.200000000000003,0,0,0,0,0,6.0363195000000003,0,40.236319499999993]
["Tage","Tage","Tag, trækassette","Tagkassette, tagpap","OSB2 Unsanded, Kronospan",1.7999999999999999E-2,"m³/m²",0.27,"m³",164.7,"kg",0,"User",true,120,1,0,0,0,-222.75,0,0,0,0,294.3,0,-15.741,71.549999999999983]
["Tage","Tage","Tag, trækassette","Tagkassette, tagpap","Papirisolering kl 37 - ISOCELL",13.6,"kg/m²",204,"kg",204,"kg",1,"User",true,40,1,0,0,0,-250.92,0,0,44.880000000000017,0,295.8,0,-182.376,89.760000000000048]
["Tage","Tage","Tag, trækassette","Tagkassette, tagpap","Papirisolering kl 37 - ISOCELL",1.8,"kg/m²",27,"kg",27,"kg",1,"User",true,40,1,0,0,0,-33.21,0,0,5.9399999999999977,0,39.15,0,-24.138000000000002,11.88]
["Tage","Tage","Tag, trækassette","Tagkassette, tagpap","Savede og tørrede konstruktionstræprodukter af fyr og gran, Fobrænding",1.0999999999999999E-2,"m³/m²",0.16500000000000001,"m³",75.239999999999995,"kg",0,"EPDDanmark",true,120,1,0,0,0,-112.2,0,0,0,0,120.12,0,-61.214999999999989,7.9200000000000017]
["Tage","Tage","Tag, trækassette","Tagkassette, tagpap","Savede og tørrede konstruktionstræprodukter af fyr og gran, Fobrænding",1.0999999999999999E-2,"m³/m²",0.16500000000000001,"m³",75.239999999999995,"kg",0,"EPDDanmark",true,120,1,0,0,0,-112.2,0,0,0,0,120.12,0,-61.214999999999989,7.9200000000000017]
["Tage","Tage","Tag, trækassette","Tagkassette, tagpap","Savede og tørrede konstruktionstræprodukter af fyr og gran, Fobrænding",4.3999999999999997E-2,"m³/m²",0.65999999999999992,"m³",300.95999999999998,"kg",0,"EPDDanmark",true,120,1,0,0,0,-448.8,0,0,0,0,480.48,0,-244.86,31.68000000000001]
["Tage","Tage","Tag, trækassette","Tagkassette, tagpap","Savede og tørrede konstruktionstræprodukter af fyr og gran, Fobrænding",7.0000000000000001E-3,"m³/m²",0.105,"m³",47.88,"kg",0,"EPDDanmark",true,120,1,0,0,0,-71.399999999999991,0,0,0,0,76.439999999999984,0,-38.954999999999991,5.039999999999992]
["Tage","Tage","Tag, trækassette","Tagkassette, tagpap","WISA Gran krydsfiner, ubehandlet, Fobrænding",2.1000000000000001E-2,"m³/m²",0.315,"m³",151.19999999999999,"kg",0,"EPDDanmark",true,120,1,0,0,0,-188.685,0,0,0,0,234.04499999999999,0,-123.16500000000001,45.359999999999957]
["Tage","Tage","Tag, trækassette","Tagkassette, tagpap","WISA Gran krydsfiner, ubehandlet, Fobrænding",2.1000000000000001E-2,"m³/m²",0.315,"m³",151.19999999999999,"kg",0,"EPDDanmark",true,120,1,0,0,0,-188.685,0,0,0,0,234.04499999999999,0,-123.16500000000001,45.359999999999957]
["Terrændæk","Terrændæk","Terrændæk, trækassette","Gulv, vådrumsgulv, keramiske fliser (Klon)","Afretningslag, cementbaseret",120,"kg/m²",600,"kg",600,"kg",0,"GenDk",true,80,1,0,0,0,110.1306,0,0,0,0,0,9.0032999999999994,0,119.1339]
["Terrændæk","Terrændæk","Terrændæk, trækassette","Gulv, vådrumsgulv, keramiske fliser (Klon)","Keramikfliser, glaseret",1,"m²/m²",5,"m²",100,"kg",0,"GenDk",true,100,1,0,0,0,30.89845,0,0,0,0,0.73372000000000004,0,-0.205398,31.632169999999999]
["Terrændæk","Terrændæk","Terrændæk, trækassette","Gulv, vådrumsgulv, keramiske fliser (Klon)","Mørtel, fliseklæber",3.1,"kg/m²",15.5,"kg",15.5,"kg",0,"GenDk",true,100,1,0,0,0,5.3789959999999999,0,0,0,0,0,0.25373034999999999,-4.4256375000000001E-2,5.6327263500000004]
["Terrændæk","Terrændæk","Terrændæk, trækassette","Gulv, vådrumsgulv, keramiske fliser (Klon)","Vandtætningsmembran, flydende",1.2,"kg/m²",6,"kg",6,"kg",0,"GenDk",true,80,1,0,0,0,6.66,0,0,0,0,1.5977999999999999E-2,0,0,6.6759779999999997]
["Terrændæk","Terrændæk","Terrændæk, trækassette","Let trækassette, terræn","Cembrit Windstopper Extreme, 9 mm",1,"m²/m²",56,"m²",806.4,"kg",0,"User",true,50,1,0,0,0,514.64,0,0,0,0,0,10.416,0,525.05600000000004]
["Terrændæk","Terrændæk","Terrændæk, trækassette","Let trækassette, terræn","Dampspærre PE (tykkelse 0,0002 m)",1,"m²/m²",56,"m²",11.2,"kg",0,"GenDk",true,80,1,0,0,0,22.366624000000002,0,0,0,0,31.133255999999999,0,-15.369872000000001,53.499879999999997]
["Terrændæk","Terrændæk","Terrændæk, trækassette","Let trækassette, terræn","Papirisolering kl 37 - ISOCELL",14.3,"kg/m²",800.80000000000007,"kg",800.80000000000007,"kg",0,"User",true,50,1,0,0,0,-984.98400000000004,0,0,0,0,1161.1600000000001,0,-357.95760000000001,176.17599999999999]
["Terrændæk","Terrændæk","Terrændæk, trækassette","Let trækassette, terræn","Savede og tørrede konstruktionstræprodukter af fyr og gran, Fobrænding",5.5E-2,"m³/m²",3.08,"m³",1404.48,"kg",0,"EPDDanmark",true,100,1,0,0,0,-2094.4,0,0,0,0,2242.2399999999998,0,-1142.68,147.84000000000009]
["Terrændæk","Terrændæk","Terrændæk, trækassette","Let trækassette, terræn","Spaandex spånplader, Spaandex spånplader (DK)",13.2,"kg/m²",739.19999999999993,"kg",739.19999999999993,"kg",0,"EPDDanmark",true,100,1,0,0,0,-1005.312,0,0,0,0,1227.0719999999999,0,-680.80319999999995,221.75999999999991]
["Terrændæk","Terrændæk","Terrændæk, trækassette","Trægulv terrændæk","Trinlydsdug - Scan Underlay",1,"m²/m²",46,"m²",48.3,"kg",0,"User",true,80,1,0,0,0,23.506,0,0,0,0,0,0.65887962,0,24.164879620000001]
["Terrændæk","Terrændæk","Terrændæk, trækassette","Trægulv terrændæk","Trægulv 14 mm ask - Tarkett Sverige",1,"m²/m²",46,"m²",363.4,"kg",0,"User",true,80,1,0,0,0,-344.54,0,0,0,0,0,556.6,0,212.06]
["Trapper og ramper","Trapper og ramper","Trappe","Trætrappe pr. etage","Savede og tørrede konstruktionstræprodukter af fyr og gran, Fobrænding",80,"kg/stk.",0.35087719298245612,"m³",160,"kg",0,"EPDDanmark",true,100,1,0,0,0,-238.59649122807019,0,0,0,0,255.43859649122811,0,-130.1754385964912,16.84210526315789]
["Trapper og ramper","Trapper og ramper","Trappe","Trætrappe pr. etage","Trægulv 14 mm ask - Tarkett Sverige",4.5,"m²/stk.",9,"m²",71.100000000000009,"kg",0,"User",true,60,1,0,0,0,-67.41,0,0,0,0,0,108.9,0,41.489999999999988]
["Trapper og ramper","Trapper og ramper","Trappe","Trætrappe pr. etage","WISA Gran krydsfiner, ubehandlet, Fobrænding",4.4999999999999998E-2,"m³/stk.",0.09,"m³",43.2,"kg",0,"EPDDanmark",true,100,1,0,0,0,-53.91,0,0,0,0,66.87,0,-35.19,12.96000000000001]
["Vand","Vandrør","Vandrør","Rustfrit stålrør","Brugsvandsrør, rustfri stål",1.3,"kg/m",39,"kg",39,"kg",0,"GenDk",true,60,1,0,0,0,138.80958000000001,0,0,0,0,0,2.660073E-2,-103.88703,138.83618073]
["Vand","Varmtvandsbeholder","VVB og buffertank","Metroair 330, indedel til VP","Buffertank, rustfri stål",220,"kg/stk.",220,"kg",220,"kg",1,"GenDk",true,30,1,0,0,0,892.82819999999992,0,0,1038.7861,0,145.9579,0,-529.31119999999999,2077.5722000000001]
["Varme","Andet (varme) ","Pumpe","Magna3 25-40","Magna3 25-(40/60/80/100/120)",1,"stk./stk.",1,"stk.",6.41,"kg",1,"User",true,30,1,0,0,0,51.3,0,0,54.642599999999987,0,3.33,1.26E-2,-3.6,109.2852]
["Varme","Radiatorer","Radiator ","Radiator, 142/2000","Panel radiator 500mm x 700mm - Lyngson",0.81142857099999999,"stk./stk.",0.81142857099999999,"stk.",16.158788562893999,"kg",1,"User",true,40,1,0,0,0,33.763542839309999,0,0,33.764342907881002,0,0,8.0006857100599989E-4,-59.883428539799993,67.528685815762003]
["Varme","Radiatorer","Radiator ","Radiator, 200/1000","Panel radiator 500mm x 700mm - Lyngson",0.571428571,"stk./stk.",1.142857142,"stk.",22.758857125788001,"kg",1,"User",true,40,1,0,0,0,47.554285678619998,0,0,47.555412535762009,0,0,1.126857142012E-3,-84.342857079599995,95.110825071524019]
["Varme","Radiatorer","Radiator ","Radiator, 200/1100","Panel radiator 500mm x 700mm - Lyngson",0.62857142899999996,"stk./stk.",0.62857142899999996,"stk.",12.517371437106,"kg",1,"User",true,40,1,0,0,0,26.15485716069,0,0,26.15547693211899,0,0,6.1977142899399991E-4,-46.388571460199998,52.31095386423798]
["Varme","Radiatorer","Radiator ","Radiator, 200/2000","Panel radiator 500mm x 700mm - Lyngson",1.1428571430000001,"stk./stk.",2.2857142860000002,"stk.",45.517714291403998,"kg",1,"User",true,40,1,0,0,0,95.108571440460011,0,0,95.11082515474601,0,0,2.2537142859959999E-3,-168.68571430680001,190.22165030949199]
["Varme","Radiatorer","Radiator ","Radiator, 200/600","Panel radiator 500mm x 700mm - Lyngson",0.34285714299999998,"stk./stk.",0.34285714299999998,"stk.",6.8276571457020001,"kg",1,"User",true,40,1,0,0,0,14.26628572023,0,0,14.266623777373001,0,0,3.3805714299799989E-4,-25.302857153400002,28.533247554745991]
["Varme","Radiatorer","Radiator ","Radiator, 300/400","Panel radiator 500mm x 700mm - Lyngson",0.34285714299999998,"stk./stk.",0.34285714299999998,"stk.",6.8276571457020001,"kg",1,"User",true,40,1,0,0,0,14.26628572023,0,0,14.266623777373001,0,0,3.3805714299799989E-4,-25.302857153400002,28.533247554745991]
["Varme","Radiatorer","Radiator ","Radiator, 600/900","Panel radiator 500mm x 700mm - Lyngson",1.542857143,"stk./stk.",1.542857143,"stk.",30.724457145702001,"kg",1,"User",true,40,1,0,0,0,64.198285720230004,0,0,64.199806977373001,0,0,1.521257142998E-3,-113.8628571534,128.399613954746]
["Varme","Varmeforsyningsanlæg","Varmepumpe","Varmepumpe luft til vand ","Varmepumpe (luft-vand) 10 kW",0.62,"stk./stk.",0.62,"stk.",83.08,"kg",1,"GenDk",true,30,1,0,0,0,284.57441999999998,0,0,305.88212119999997,0,18.653009999999998,2.6546911999999998,-299.48604,611.76424239999994]
["Varme","Varmerør","Varmerør","Press rør","Brugsvandsrør, rustfri stål",1.2585500000000001,"kg/m",125.855,"kg",125.855,"kg",0,"GenDk",true,80,1,0,0,0,447.94563310000001,0,0,0,0,0,8.5841919850000004E-2,-335.24877335000002,448.03147501985001]
["Ventilation og køl ","Ventilationskanaler","Afkast emhætte","Ventilationskanaler Ø125, enfamiliehuse og etageboliger, central","Ventilationskanal, galvaniseret stål",1.5249999999999999,"kg/m",1.5249999999999999,"kg",1.5249999999999999,"kg",0,"GenDk",true,50,1,0,0,0,4.6470104999999986,0,0,0,0,2.4963792499999998E-3,0,-2.4193820000000001,4.6495068792499996]
["Vinduer, døre, glasfacader","Døre","Indvendige døre","Dør, indvendig","Fastgørelsesmidler/skruer i galvaniseret stål",1,"kg/stk.",4,"kg",4,"kg",0,"GenDk",true,50,1,0,0,0,14.220039999999999,0,0,0,0,0,2.72828E-3,-7.2424799999999996,14.22276828]
["Vinduer, døre, glasfacader","Døre","Indvendige døre","Dør, indvendig","Overflade, Indendørsmaling, emulsions maling, slidstærk",0.35749999999999998,"kg/stk.",1.43,"kg",1.43,"kg",0,"GenDk",true,50,1,0,0,0,3.7483588999999999,0,0,0,0,0,2.1457865E-2,-1.547689E-2,3.7698167649999998]
["Vinduer, døre, glasfacader","Døre","Indvendige døre","Dør, indvendig","Spånplade",33,"kg/stk.",0.18857142857142861,"m³",132,"kg",0,"GenDk",true,50,1,0,0,0,-164.73486857142859,0,0,0,0,239.19720000000001,0,-0.55332325714285713,74.462331428571417]
["Vinduer, døre, glasfacader","Døre","Indvendige døre","Dør, indvendig","Træ, fyrretræ (12% fugt / 10,7% H2O)",10,"kg/stk.",7.2886297376093298E-2,"m³",40,"kg",0,"GenDk",true,50,1,0,0,0,-57.079373177842569,0,0,0,0,71.796574344023327,0,-18.974781341107871,14.717201166180759]
["Vinduer, døre, glasfacader","Døre","Udvendig dør","Udvendig dør, træ","Grå støbejern",0.05,"kg/m²",0.105,"kg",0.105,"kg",0,"GenDk",true,60,1,0,0,0,0.1717128,0,0,0,0,0,7.1617350000000013E-5,-4.1265000000000003E-2,0.17178441735]
["Vinduer, døre, glasfacader","Døre","Udvendig dør","Udvendig dør, træ","Høvlede konstruktionstræsprodukter af fyr og gran, Fobrænding",1.63,"kg/m²",7.5065789473684214E-3,"m³",3.423,"kg",0,"EPDDanmark",true,60,1,0,0,0,-5.0294078947368419,0,0,0,0,5.4647894736842098,0,-2.784940789473684,0.43538157894736779]
["Vinduer, døre, glasfacader","Døre","Udvendig dør","Udvendig dør, træ","Savede og tørrede konstruktionstræprodukter af fyr og gran, Fobrænding",22.53,"kg/m²",0.10375657894736839,"m³",47.313000000000002,"kg",1,"EPDDanmark",true,40,1,0,0,0,-70.554473684210521,0,0,4.9803157894736927,0,75.534789473684214,0,-76.987381578947364,9.9606315789473854]
["Vinduer, døre, glasfacader","Vinduer","Facadevinduer ","Facadevinduer","Trævindue med 3-lags rude",1,"m²/m²",22,"m²",752.40000000000009,"kg",1,"EPDDanmark",true,25,1,0,0,0,953.26,0,0,1391.5,0,415.8,22.44,-756.8,2783]
["Vinduer, døre, glasfacader","Vinduer","Ovenlys","Velux GGL ovenlys m. aluinddækning, 3-lagsrude (træ)","Velux GGL ovenlys m. aluinddækning, 3-lagsrude (træ)",1,"m²/m²",9,"m²",394.3125,"kg",1,"User",true,30,1,0,0,0,657.9,0,0,715.94099999999992,0,2.2410000000000001,55.799999999999983,0,1431.8820000000001]
["Vinduer, døre, glasfacader","Vinduer","Ovenlys","Velux modular skylight, 3-lagsrude","Velux modular skylight, 3-lagsrude",1,"m²/m²",2,"m²",134.4,"kg",1,"User",true,30,1,0,0,0,390.86,0,0,400.48,0,6.98,2.64,-110,800.96]
["Ydervægge","Ydervægge","Ydervæg, trækassette","Facadekassette uden beklædning","Cembrit Windstopper Extreme, 9 mm",1,"m²/m²",148,"m²",2131.1999999999998,"kg",0,"User",true,80,1,0,0,0,1360.12,0,0,0,0,0,27.528000000000009,0,1387.6479999999999]
["Ydervægge","Ydervægge","Ydervæg, trækassette","Facadekassette uden beklædning","Dampspærre PE (tykkelse 0,0002 m)",1,"m²/m²",148,"m²",29.6,"kg",0,"GenDk",true,80,1,0,0,0,59.111791999999987,0,0,0,0,82.280748000000003,0,-40.620376,141.39254]
["Ydervægge","Ydervægge","Ydervæg, trækassette","Facadekassette uden beklædning","Fermacell fiberplade 12,5 mm",2,"m²/m²",296,"m²",4366,"kg",0,"User",true,50,1,0,0,0,337.44,0,0,0,0,0,59.558352399999997,0,396.99835239999999]
["Ydervægge","Ydervægge","Ydervæg, trækassette","Facadekassette uden beklædning","OSB2 Unsanded, Kronospan",1.7999999999999999E-2,"m³/m²",2.6640000000000001,"m³",1625.04,"kg",0,"User",true,120,1,0,0,0,-2197.8000000000002,0,0,0,0,2903.76,0,-155.31120000000001,705.96]
["Ydervægge","Ydervægge","Ydervæg, trækassette","Facadekassette uden beklædning","Papirisolering kl 37 - ISOCELL",12.5,"kg/m²",1850,"kg",1850,"kg",0,"User",true,60,1,0,0,0,-2275.5,0,0,0,0,2682.5,0,-826.95,407]
["Ydervægge","Ydervægge","Ydervæg, trækassette","Facadekassette uden beklædning","Papirisolering kl 37 - ISOCELL",1.91,"kg/m²",282.68,"kg",282.68,"kg",0,"User",true,60,1,0,0,0,-347.69639999999998,0,0,0,0,409.88600000000002,0,-126.35796000000001,62.189600000000041]
["Ydervægge","Ydervægge","Ydervæg, trækassette","Facadekassette uden beklædning","Savede og tørrede konstruktionstræprodukter af fyr og gran, Fobrænding",4.3999999999999997E-2,"m³/m²",6.5119999999999996,"m³",2969.4720000000002,"kg",0,"EPDDanmark",true,120,1,0,0,0,-4428.16,0,0,0,0,4740.735999999999,0,-2415.9519999999989,312.57599999999911]
["Ydervægge","Ydervægge","Ydervæg, trækassette","Facadekassette uden beklædning","Savede og tørrede konstruktionstræprodukter af fyr og gran, Fobrænding",7.0000000000000001E-3,"m³/m²",1.036,"m³",472.416,"kg",0,"EPDDanmark",true,120,1,0,0,0,-704.48,0,0,0,0,754.20799999999997,0,-384.35599999999999,49.727999999999952]
["Ydervægge","Ydervægge","Ydervæg, trækassette","Tilbagetrukket facadekassette uden beklædning","Cembrit Windstopper Extreme, 9 mm",1,"m²/m²",9,"m²",129.6,"kg",0,"User",true,80,1,0,0,0,82.71,0,0,0,0,0,1.6739999999999999,0,84.384]
["Ydervægge","Ydervægge","Ydervæg, trækassette","Tilbagetrukket facadekassette uden beklædning","Dampspærre PE (tykkelse 0,0002 m)",1,"m²/m²",9,"m²",1.8,"kg",0,"GenDk",true,80,1,0,0,0,3.5946359999999999,0,0,0,0,5.0035590000000001,0,-2.4701580000000001,8.5981950000000005]
["Ydervægge","Ydervægge","Ydervæg, trækassette","Tilbagetrukket facadekassette uden beklædning","Fermacell fiberplade 12,5 mm",2,"m²/m²",18,"m²",265.5,"kg",0,"User",true,50,1,0,0,0,20.52,0,0,0,0,0,3.6217917000000002,0,24.141791699999999]
["Ydervægge","Ydervægge","Ydervæg, trækassette","Tilbagetrukket facadekassette uden beklædning","OSB2 Unsanded, Kronospan",1.7999999999999999E-2,"m³/m²",0.16200000000000001,"m³",98.82,"kg",0,"User",true,120,1,0,0,0,-133.65,0,0,0,0,176.58,0,-9.4445999999999977,42.930000000000007]
["Ydervægge","Ydervægge","Ydervæg, trækassette","Tilbagetrukket facadekassette uden beklædning","Papirisolering kl 37 - ISOCELL",8.3000000000000007,"kg/m²",74.7,"kg",74.7,"kg",0,"User",true,60,1,0,0,0,-91.881,0,0,0,0,108.315,0,-33.390900000000002,16.434000000000001]
["Ydervægge","Ydervægge","Ydervæg, trækassette","Tilbagetrukket facadekassette uden beklædning","Papirisolering kl 37 - ISOCELL",1.91,"kg/m²",17.190000000000001,"kg",17.190000000000001,"kg",0,"User",true,60,1,0,0,0,-21.143699999999999,0,0,0,0,24.9255,0,-7.6839299999999993,3.7818000000000001]
["Ydervægge","Ydervægge","Ydervæg, trækassette","Tilbagetrukket facadekassette uden beklædning","Savede og tørrede konstruktionstræprodukter af fyr og gran, Fobrænding",2.9000000000000001E-2,"m³/m²",0.26100000000000001,"m³",119.01600000000001,"kg",0,"EPDDanmark",true,120,1,0,0,0,-177.48,0,0,0,0,190.00800000000001,0,-96.831000000000003,12.52799999999999]
["Ydervægge","Ydervægge","Ydervæg, trækassette","Tilbagetrukket facadekassette uden beklædning","Savede og tørrede konstruktionstræprodukter af fyr og gran, Fobrænding",7.0000000000000001E-3,"m³/m²",6.3E-2,"m³",28.728000000000002,"kg",0,"EPDDanmark",true,120,1,0,0,0,-42.84,0,0,0,0,45.863999999999997,0,-23.373000000000001,3.0239999999999938]
["Ydervægge","Ydervægge","Ydervæg, trækassette","Træbeklædning med ophæng","Savede og tørrede konstruktionstræprodukter af fyr og gran, Fobrænding",2E-3,"m³/m²",0.29599999999999999,"m³",134.976,"kg",0,"EPDDanmark",true,120,1,0,0,0,-201.28,0,0,0,0,215.488,0,-109.816,14.208]
["Ydervægge","Ydervægge","Ydervæg, trækassette","Træbeklædning med ophæng","Savede og tørrede konstruktionstræprodukter af fyr og gran, Fobrænding",4.0000000000000001E-3,"m³/m²",0.59199999999999997,"m³",269.952,"kg",0,"EPDDanmark",true,120,1,0,0,0,-402.56,0,0,0,0,430.976,0,-219.63200000000001,28.416]
["Ydervægge","Ydervægge","Ydervæg, trækassette","Træbeklædning med ophæng","Træbeklædning 19 mm, ubehandlet gran - InnTre Kjeldstad AS",1.105,"m²/m²",163.54,"m²",1409.7148,"kg",0,"User",true,50,1,0,0,0,-2060.6039999999998,0,0,0,0,2453.1,0.1700816,-137.53713999999999,392.6660816000001]
["Ydervægge","Ydervægge","Ydervæg, trækassette","Træbeklædning tilbagetrukket med ophæng","Savede og tørrede konstruktionstræprodukter af fyr og gran, Fobrænding",2E-3,"m³/m²",1.7999999999999999E-2,"m³",8.2080000000000002,"kg",0,"EPDDanmark",true,120,1,0,0,0,-12.24,0,0,0,0,13.103999999999999,0,-6.6779999999999999,0.86399999999999721]
["Ydervægge","Ydervægge","Ydervæg, trækassette","Træbeklædning tilbagetrukket med ophæng","Savede og tørrede konstruktionstræprodukter af fyr og gran, Fobrænding",4.0000000000000001E-3,"m³/m²",3.5999999999999997E-2,"m³",16.416,"kg",0,"EPDDanmark",true,120,1,0,0,0,-24.48,0,0,0,0,26.207999999999998,0,-13.356,1.727999999999994]
["Ydervægge","Ydervægge","Ydervæg, trækassette","Træbeklædning tilbagetrukket med ophæng","Træbeklædning 19 mm, ubehandlet gran - InnTre Kjeldstad AS",1.105,"m²/m²",9.9450000000000003,"m²",85.725899999999996,"kg",0,"User",true,50,1,0,0,0,-125.307,0,0,0,0,149.17500000000001,1.0342799999999999E-2,-8.3637449999999998,23.878342800000009]

{"sheet":"Bygning","index":10,"n_rows":139,"n_cols":12,"rows_kept":139,"cut":false,"hidden":false,"merged":[]}
["Column1","Column2","Column3","Column4","Column5",null,null,null,"Medtag","År","El [kg CO2eq/kWh]","Varme [kg CO2eq/kWh]"]
["El forbrug","Varme forbrug","Eksporeret el","El forsyning","Varme forsyning",null,null,null,{"$f":"IFERROR(IF(AND(Forside!$D$12<=J2,Forside!$D$12+Betragtningstid-1>=Bygning!J2),\"x\",\"\"),\"\")","v":""},2015,0.35199999999999998,0.18720000000000001]
[5.0999999999999996,0,0.2,"El - Fremskrivning 2020-2040","El - Fremskrivning 2020-2040",null,null,null,{"$f":"IFERROR(IF(AND(Forside!$D$12<=J3,Forside!$D$12+Betragtningstid-1>=Bygning!J3),\"x\",\"\"),\"\")","v":""},2016,0.33439999999999998,0.17604]
[null,null,null,null,null,null,null,null,{"$f":"IFERROR(IF(AND(Forside!$D$12<=J4,Forside!$D$12+Betragtningstid-1>=Bygning!J4),\"x\",\"\"),\"\")","v":""},2017,0.31679999999999997,0.16488]
["Adresse","Ejer","Bygningstype",null,null,null,null,null,{"$f":"IFERROR(IF(AND(Forside!$D$12<=J5,Forside!$D$12+Betragtningstid-1>=Bygning!J5),\"x\",\"\"),\"\")","v":""},2018,0.29920000000000002,0.15372]
["Otto Bussens Vej, 2450 København ",null,"Bolig-parcelhus",null,null,null,null,null,{"$f":"IFERROR(IF(AND(Forside!$D$12<=J6,Forside!$D$12+Betragtningstid-1>=Bygning!J6),\"x\",\"\"),\"\")","v":""},2019,0.28160000000000002,0.14255999999999999]
[null,null,null,null,null,null,null,null,{"$f":"IFERROR(IF(AND(Forside!$D$12<=J7,Forside!$D$12+Betragtningstid-1>=Bygning!J7),\"x\",\"\"),\"\")","v":""},2020,0.26400000000000001,0.13139999999999999]
["opvarmet areal","Etageareal",null,null,null,null,null,null,{"$f":"IFERROR(IF(AND(Forside!$D$12<=J8,Forside!$D$12+Betragtningstid-1>=Bygning!J8),\"x\",\"\"),\"\")","v":""},2021,0.23820000000000002,0.12268799999999999]
[147,147,null,null,null,null,null,null,{"$f":"IFERROR(IF(AND(Forside!$D$12<=J9,Forside!$D$12+Betragtningstid-1>=Bygning!J9),\"x\",\"\"),\"\")","v":"x"},2022,0.21240000000000001,0.11397599999999999]
[null,null,null,null,null,null,null,null,{"$f":"IFERROR(IF(AND(Forside!$D$12<=J10,Forside!$D$12+Betragtningstid-1>=Bygning!J10),\"x\",\"\"),\"\")","v":"x"},2023,0.18660000000000002,0.105264]
["År for ibrugtagning","Betragningsperiode","Brug FBK","Brug DGNB",null,null,null,null,{"$f":"IFERROR(IF(AND(Forside!$D$12<=J11,Forside!$D$12+Betragtningstid-1>=Bygning!J11),\"x\",\"\"),\"\")","v":"x"},2024,0.1608,9.6551999999999999E-2]
[2022,50,false,false,null,null,null,null,{"$f":"IFERROR(IF(AND(Forside!$D$12<=J12,Forside!$D$12+Betragtningstid-1>=Bygning!J12),\"x\",\"\"),\"\")","v":"x"},2025,0.13500000000000001,8.7840000000000001E-2]
[null,null,null,null,null,null,null,null,{"$f":"IFERROR(IF(AND(Forside!$D$12<=J13,Forside!$D$12+Betragtningstid-1>=Bygning!J13),\"x\",\"\"),\"\")","v":"x"},2026,0.1174,8.4528000000000006E-2]
[null,null,null,null,null,null,null,null,{"$f":"IFERROR(IF(AND(Forside!$D$12<=J14,Forside!$D$12+Betragtningstid-1>=Bygning!J14),\"x\",\"\"),\"\")","v":"x"},2027,9.98E-2,8.121600000000001E-2]
["Yderligere beskrivelse",null,null,null,null,null,null,null,{"$f":"IFERROR(IF(AND(Forside!$D$12<=J15,Forside!$D$12+Betragtningstid-1>=Bygning!J15),\"x\",\"\"),\"\")","v":"x"},2028,8.2200000000000009E-2,7.7904000000000001E-2]
[null,null,"Enfamiliehus med naturlig ventilation ",null,null,null,null,null,{"$f":"IFERROR(IF(AND(Forside!$D$12<=J16,Forside!$D$12+Betragtningstid-1>=Bygning!J16),\"x\",\"\"),\"\")","v":"x"},2029,6.4600000000000005E-2,7.4592000000000006E-2]
[null,null,null,null,null,null,null,null,{"$f":"IFERROR(IF(AND(Forside!$D$12<=J17,Forside!$D$12+Betragtningstid-1>=Bygning!J17),\"x\",\"\"),\"\")","v":"x"},2030,4.7E-2,7.128000000000001E-2]
[null,null,null,null,null,null,null,null,{"$f":"IFERROR(IF(AND(Forside!$D$12<=J18,Forside!$D$12+Betragtningstid-1>=Bygning!J18),\"x\",\"\"),\"\")","v":"x"},2031,4.5879999999999997E-2,7.0776000000000006E-2]
[null,null,null,null,null,null,null,null,{"$f":"IFERROR(IF(AND(Forside!$D$12<=J19,Forside!$D$12+Betragtningstid-1>=Bygning!J19),\"x\",\"\"),\"\")","v":"x"},2032,4.4760000000000001E-2,7.0272000000000001E-2]
[null,null,null,null,null,null,null,null,{"$f":"IFERROR(IF(AND(Forside!$D$12<=J20,Forside!$D$12+Betragtningstid-1>=Bygning!J20),\"x\",\"\"),\"\")","v":"x"},2033,4.3639999999999998E-2,6.9768000000000011E-2]
[null,null,null,null,null,null,null,null,{"$f":"IFERROR(IF(AND(Forside!$D$12<=J21,Forside!$D$12+Betragtningstid-1>=Bygning!J21),\"x\",\"\"),\"\")","v":"x"},2034,4.2520000000000002E-2,6.9264000000000006E-2]
[null,null,null,null,null,null,null,null,{"$f":"IFERROR(IF(AND(Forside!$D$12<=J22,Forside!$D$12+Betragtningstid-1>=Bygning!J22),\"x\",\"\"),\"\")","v":"x"},2035,4.1399999999999999E-2,6.8760000000000002E-2]
[null,null,null,null,null,null,null,null,{"$f":"IFERROR(IF(AND(Forside!$D$12<=J23,Forside!$D$12+Betragtningstid-1>=Bygning!J23),\"x\",\"\"),\"\")","v":"x"},2036,4.1180000000000001E-2,6.8615999999999996E-2]
[null,null,null,null,null,null,null,null,{"$f":"IFERROR(IF(AND(Forside!$D$12<=J24,Forside!$D$12+Betragtningstid-1>=Bygning!J24),\"x\",\"\"),\"\")","v":"x"},2037,4.0960000000000003E-2,6.8472000000000005E-2]
[null,null,null,null,null,null,null,null,{"$f":"IFERROR(IF(AND(Forside!$D$12<=J25,Forside!$D$12+Betragtningstid-1>=Bygning!J25),\"x\",\"\"),\"\")","v":"x"},2038,4.0739999999999998E-2,6.8328E-2]
[null,null,null,null,null,null,null,null,{"$f":"IFERROR(IF(AND(Forside!$D$12<=J26,Forside!$D$12+Betragtningstid-1>=Bygning!J26),\"x\",\"\"),\"\")","v":"x"},2039,4.052E-2,6.8184000000000008E-2]
[null,null,null,null,null,null,null,null,{"$f":"IFERROR(IF(AND(Forside!$D$12<=J27,Forside!$D$12+Betragtningstid-1>=Bygning!J27),\"x\",\"\"),\"\")","v":"x"},2040,4.0300000000000002E-2,6.8040000000000003E-2]
[null,null,null,null,null,null,null,null,{"$f":"IFERROR(IF(AND(Forside!$D$12<=J28,Forside!$D$12+Betragtningstid-1>=Bygning!J28),\"x\",\"\"),\"\")","v":"x"},2041,4.0300000000000002E-2,6.8040000000000003E-2]
[null,null,null,null,null,null,null,null,{"$f":"IFERROR(IF(AND(Forside!$D$12<=J29,Forside!$D$12+Betragtningstid-1>=Bygning!J29),\"x\",\"\"),\"\")","v":"x"},2042,4.0300000000000002E-2,6.8040000000000003E-2]
[null,null,null,null,null,null,null,null,{"$f":"IFERROR(IF(AND(Forside!$D$12<=J30,Forside!$D$12+Betragtningstid-1>=Bygning!J30),\"x\",\"\"),\"\")","v":"x"},2043,4.0300000000000002E-2,6.8040000000000003E-2]
[null,null,null,null,null,null,null,null,{"$f":"IFERROR(IF(AND(Forside!$D$12<=J31,Forside!$D$12+Betragtningstid-1>=Bygning!J31),\"x\",\"\"),\"\")","v":"x"},2044,4.0300000000000002E-2,6.8040000000000003E-2]
[null,null,null,null,null,null,null,null,{"$f":"IFERROR(IF(AND(Forside!$D$12<=J32,Forside!$D$12+Betragtningstid-1>=Bygning!J32),\"x\",\"\"),\"\")","v":"x"},2045,4.0300000000000002E-2,6.8040000000000003E-2]
[null,null,null,null,null,null,null,null,{"$f":"IFERROR(IF(AND(Forside!$D$12<=J33,Forside!$D$12+Betragtningstid-1>=Bygning!J33),\"x\",\"\"),\"\")","v":"x"},2046,4.0300000000000002E-2,6.8040000000000003E-2]
[null,null,null,null,null,null,null,null,{"$f":"IFERROR(IF(AND(Forside!$D$12<=J34,Forside!$D$12+Betragtningstid-1>=Bygning!J34),\"x\",\"\"),\"\")","v":"x"},2047,4.0300000000000002E-2,6.8040000000000003E-2]
[null,null,null,null,null,null,null,null,{"$f":"IFERROR(IF(AND(Forside!$D$12<=J35,Forside!$D$12+Betragtningstid-1>=Bygning!J35),\"x\",\"\"),\"\")","v":"x"},2048,4.0300000000000002E-2,6.8040000000000003E-2]
[null,null,null,null,null,null,null,null,{"$f":"IFERROR(IF(AND(Forside!$D$12<=J36,Forside!$D$12+Betragtningstid-1>=Bygning!J36),\"x\",\"\"),\"\")","v":"x"},2049,4.0300000000000002E-2,6.8040000000000003E-2]
[null,null,null,null,null,null,null,null,{"$f":"IFERROR(IF(AND(Forside!$D$12<=J37,Forside!$D$12+Betragtningstid-1>=Bygning!J37),\"x\",\"\"),\"\")","v":"x"},2050,4.0300000000000002E-2,6.8040000000000003E-2]
[null,null,null,null,null,null,null,null,{"$f":"IFERROR(IF(AND(Forside!$D$12<=J38,Forside!$D$12+Betragtningstid-1>=Bygning!J38),\"x\",\"\"),\"\")","v":"x"},2051,4.0300000000000002E-2,6.8040000000000003E-2]
[null,null,null,null,null,null,null,null,{"$f":"IFERROR(IF(AND(Forside!$D$12<=J39,Forside!$D$12+Betragtningstid-1>=Bygning!J39),\"x\",\"\"),\"\")","v":"x"},2052,4.0300000000000002E-2,6.8040000000000003E-2]
[null,null,null,null,null,null,null,null,{"$f":"IFERROR(IF(AND(Forside!$D$12<=J40,Forside!$D$12+Betragtningstid-1>=Bygning!J40),\"x\",\"\"),\"\")","v":"x"},2053,4.0300000000000002E-2,6.8040000000000003E-2]
[null,null,null,null,null,null,null,null,{"$f":"IFERROR(IF(AND(Forside!$D$12<=J41,Forside!$D$12+Betragtningstid-1>=Bygning!J41),\"x\",\"\"),\"\")","v":"x"},2054,4.0300000000000002E-2,6.8040000000000003E-2]
[null,null,null,null,null,null,null,null,{"$f":"IFERROR(IF(AND(Forside!$D$12<=J42,Forside!$D$12+Betragtningstid-1>=Bygning!J42),\"x\",\"\"),\"\")","v":"x"},2055,4.0300000000000002E-2,6.8040000000000003E-2]
[null,null,null,null,null,null,null,null,{"$f":"IFERROR(IF(AND(Forside!$D$12<=J43,Forside!$D$12+Betragtningstid-1>=Bygning!J43),\"x\",\"\"),\"\")","v":"x"},2056,4.0300000000000002E-2,6.8040000000000003E-2]
[null,null,null,null,null,null,null,null,{"$f":"IFERROR(IF(AND(Forside!$D$12<=J44,Forside!$D$12+Betragtningstid-1>=Bygning!J44),\"x\",\"\"),\"\")","v":"x"},2057,4.0300000000000002E-2,6.8040000000000003E-2]
[null,null,null,null,null,null,null,null,{"$f":"IFERROR(IF(AND(Forside!$D$12<=J45,Forside!$D$12+Betragtningstid-1>=Bygning!J45),\"x\",\"\"),\"\")","v":"x"},2058,4.0300000000000002E-2,6.8040000000000003E-2]
[null,null,null,null,null,null,null,null,{"$f":"IFERROR(IF(AND(Forside!$D$12<=J46,Forside!$D$12+Betragtningstid-1>=Bygning!J46),\"x\",\"\"),\"\")","v":"x"},2059,4.0300000000000002E-2,6.8040000000000003E-2]
[null,null,null,null,null,null,null,null,{"$f":"IFERROR(IF(AND(Forside!$D$12<=J47,Forside!$D$12+Betragtningstid-1>=Bygning!J47),\"x\",\"\"),\"\")","v":"x"},2060,4.0300000000000002E-2,6.8040000000000003E-2]
[null,null,null,null,null,null,null,null,{"$f":"IFERROR(IF(AND(Forside!$D$12<=J48,Forside!$D$12+Betragtningstid-1>=Bygning!J48),\"x\",\"\"),\"\")","v":"x"},2061,4.0300000000000002E-2,6.8040000000000003E-2]
[null,null,null,null,null,null,null,null,{"$f":"IFERROR(IF(AND(Forside!$D$12<=J49,Forside!$D$12+Betragtningstid-1>=Bygning!J49),\"x\",\"\"),\"\")","v":"x"},2062,4.0300000000000002E-2,6.8040000000000003E-2]
[null,null,null,null,null,null,null,null,{"$f":"IFERROR(IF(AND(Forside!$D$12<=J50,Forside!$D$12+Betragtningstid-1>=Bygning!J50),\"x\",\"\"),\"\")","v":"x"},2063,4.0300000000000002E-2,6.8040000000000003E-2]
[null,null,null,null,null,null,null,null,{"$f":"IFERROR(IF(AND(Forside!$D$12<=J51,Forside!$D$12+Betragtningstid-1>=Bygning!J51),\"x\",\"\"),\"\")","v":"x"},2064,4.0300000000000002E-2,6.8040000000000003E-2]
[null,null,null,null,null,null,null,null,{"$f":"IFERROR(IF(AND(Forside!$D$12<=J52,Forside!$D$12+Betragtningstid-1>=Bygning!J52),\"x\",\"\"),\"\")","v":"x"},2065,4.0300000000000002E-2,6.8040000000000003E-2]
[null,null,null,null,null,null,null,null,{"$f":"IFERROR(IF(AND(Forside!$D$12<=J53,Forside!$D$12+Betragtningstid-1>=Bygning!J53),\"x\",\"\"),\"\")","v":"x"},2066,4.0300000000000002E-2,6.8040000000000003E-2]
[null,null,null,null,null,null,null,null,{"$f":"IFERROR(IF(AND(Forside!$D$12<=J54,Forside!$D$12+Betragtningstid-1>=Bygning!J54),\"x\",\"\"),\"\")","v":"x"},2067,4.0300000000000002E-2,6.8040000000000003E-2]
[null,null,null,null,null,null,null,null,{"$f":"IFERROR(IF(AND(Forside!$D$12<=J55,Forside!$D$12+Betragtningstid-1>=Bygning!J55),\"x\",\"\"),\"\")","v":"x"},2068,4.0300000000000002E-2,6.8040000000000003E-2]
[null,null,null,null,null,null,null,null,{"$f":"IFERROR(IF(AND(Forside!$D$12<=J56,Forside!$D$12+Betragtningstid-1>=Bygning!J56),\"x\",\"\"),\"\")","v":"x"},2069,4.0300000000000002E-2,6.8040000000000003E-2]
[null,null,null,null,null,null,null,null,{"$f":"IFERROR(IF(AND(Forside!$D$12<=J57,Forside!$D$12+Betragtningstid-1>=Bygning!J57),\"x\",\"\"),\"\")","v":"x"},2070,4.0300000000000002E-2,6.8040000000000003E-2]
[null,null,null,null,null,null,null,null,{"$f":"IFERROR(IF(AND(Forside!$D$12<=J58,Forside!$D$12+Betragtningstid-1>=Bygning!J58),\"x\",\"\"),\"\")","v":"x"},2071,4.0300000000000002E-2,6.8040000000000003E-2]
[null,null,null,null,null,null,null,null,{"$f":"IFERROR(IF(AND(Forside!$D$12<=J59,Forside!$D$12+Betragtningstid-1>=Bygning!J59),\"x\",\"\"),\"\")","v":""},2072,4.0300000000000002E-2,6.8040000000000003E-2]
[null,null,null,null,null,null,null,null,{"$f":"IFERROR(IF(AND(Forside!$D$12<=J60,Forside!$D$12+Betragtningstid-1>=Bygning!J60),\"x\",\"\"),\"\")","v":""},2073,4.0300000000000002E-2,6.8040000000000003E-2]
[null,null,null,null,null,null,null,null,{"$f":"IFERROR(IF(AND(Forside!$D$12<=J61,Forside!$D$12+Betragtningstid-1>=Bygning!J61),\"x\",\"\"),\"\")","v":""},2074,4.0300000000000002E-2,6.8040000000000003E-2]
[null,null,null,null,null,null,null,null,{"$f":"IFERROR(IF(AND(Forside!$D$12<=J62,Forside!$D$12+Betragtningstid-1>=Bygning!J62),\"x\",\"\"),\"\")","v":""},2075,4.0300000000000002E-2,6.8040000000000003E-2]
[null,null,null,null,null,null,null,null,{"$f":"IFERROR(IF(AND(Forside!$D$12<=J63,Forside!$D$12+Betragtningstid-1>=Bygning!J63),\"x\",\"\"),\"\")","v":""},2076,4.0300000000000002E-2,6.8040000000000003E-2]
[null,null,null,null,null,null,null,null,{"$f":"IFERROR(IF(AND(Forside!$D$12<=J64,Forside!$D$12+Betragtningstid-1>=Bygning!J64),\"x\",\"\"),\"\")","v":""},2077,4.0300000000000002E-2,6.8040000000000003E-2]
[null,null,null,null,null,null,null,null,{"$f":"IFERROR(IF(AND(Forside!$D$12<=J65,Forside!$D$12+Betragtningstid-1>=Bygning!J65),\"x\",\"\"),\"\")","v":""},2078,4.0300000000000002E-2,6.8040000000000003E-2]
[null,null,null,null,null,null,null,null,{"$f":"IFERROR(IF(AND(Forside!$D$12<=J66,Forside!$D$12+Betragtningstid-1>=Bygning!J66),\"x\",\"\"),\"\")","v":""},2079,4.0300000000000002E-2,6.8040000000000003E-2]
[null,null,null,null,null,null,null,null,{"$f":"IFERROR(IF(AND(Forside!$D$12<=J67,Forside!$D$12+Betragtningstid-1>=Bygning!J67),\"x\",\"\"),\"\")","v":""},2080,4.0300000000000002E-2,6.8040000000000003E-2]
[null,null,null,null,null,null,null,null,{"$f":"IFERROR(IF(AND(Forside!$D$12<=J68,Forside!$D$12+Betragtningstid-1>=Bygning!J68),\"x\",\"\"),\"\")","v":""},2081,4.0300000000000002E-2,6.8040000000000003E-2]
[null,null,null,null,null,null,null,null,{"$f":"IFERROR(IF(AND(Forside!$D$12<=J69,Forside!$D$12+Betragtningstid-1>=Bygning!J69),\"x\",\"\"),\"\")","v":""},2082,4.0300000000000002E-2,6.8040000000000003E-2]
[null,null,null,null,null,null,null,null,{"$f":"IFERROR(IF(AND(Forside!$D$12<=J70,Forside!$D$12+Betragtningstid-1>=Bygning!J70),\"x\",\"\"),\"\")","v":""},2083,4.0300000000000002E-2,6.8040000000000003E-2]
[null,null,null,null,null,null,null,null,{"$f":"IFERROR(IF(AND(Forside!$D$12<=J71,Forside!$D$12+Betragtningstid-1>=Bygning!J71),\"x\",\"\"),\"\")","v":""},2084,4.0300000000000002E-2,6.8040000000000003E-2]
[null,null,null,null,null,null,null,null,{"$f":"IFERROR(IF(AND(Forside!$D$12<=J72,Forside!$D$12+Betragtningstid-1>=Bygning!J72),\"x\",\"\"),\"\")","v":""},2085,4.0300000000000002E-2,6.8040000000000003E-2]
[null,null,null,null,null,null,null,null,{"$f":"IFERROR(IF(AND(Forside!$D$12<=J73,Forside!$D$12+Betragtningstid-1>=Bygning!J73),\"x\",\"\"),\"\")","v":""},2086,4.0300000000000002E-2,6.8040000000000003E-2]
[null,null,null,null,null,null,null,null,{"$f":"IFERROR(IF(AND(Forside!$D$12<=J74,Forside!$D$12+Betragtningstid-1>=Bygning!J74),\"x\",\"\"),\"\")","v":""},2087,4.0300000000000002E-2,6.8040000000000003E-2]
[null,null,null,null,null,null,null,null,{"$f":"IFERROR(IF(AND(Forside!$D$12<=J75,Forside!$D$12+Betragtningstid-1>=Bygning!J75),\"x\",\"\"),\"\")","v":""},2088,4.0300000000000002E-2,6.8040000000000003E-2]
[null,null,null,null,null,null,null,null,{"$f":"IFERROR(IF(AND(Forside!$D$12<=J76,Forside!$D$12+Betragtningstid-1>=Bygning!J76),\"x\",\"\"),\"\")","v":""},2089,4.0300000000000002E-2,6.8040000000000003E-2]
[null,null,null,null,null,null,null,null,{"$f":"IFERROR(IF(AND(Forside!$D$12<=J77,Forside!$D$12+Betragtningstid-1>=Bygning!J77),\"x\",\"\"),\"\")","v":""},2090,4.0300000000000002E-2,6.8040000000000003E-2]
[null,null,null,null,null,null,null,null,{"$f":"IFERROR(IF(AND(Forside!$D$12<=J78,Forside!$D$12+Betragtningstid-1>=Bygning!J78),\"x\",\"\"),\"\")","v":""},2091,4.0300000000000002E-2,6.8040000000000003E-2]
[null,null,null,null,null,null,null,null,{"$f":"IFERROR(IF(AND(Forside!$D$12<=J79,Forside!$D$12+Betragtningstid-1>=Bygning!J79),\"x\",\"\"),\"\")","v":""},2092,4.0300000000000002E-2,6.8040000000000003E-2]
[null,null,null,null,null,null,null,null,{"$f":"IFERROR(IF(AND(Forside!$D$12<=J80,Forside!$D$12+Betragtningstid-1>=Bygning!J80),\"x\",\"\"),\"\")","v":""},2093,4.0300000000000002E-2,6.8040000000000003E-2]
[null,null,null,null,null,null,null,null,{"$f":"IFERROR(IF(AND(Forside!$D$12<=J81,Forside!$D$12+Betragtningstid-1>=Bygning!J81),\"x\",\"\"),\"\")","v":""},2094,4.0300000000000002E-2,6.8040000000000003E-2]
[null,null,null,null,null,null,null,null,{"$f":"IFERROR(IF(AND(Forside!$D$12<=J82,Forside!$D$12+Betragtningstid-1>=Bygning!J82),\"x\",\"\"),\"\")","v":""},2095,4.0300000000000002E-2,6.8040000000000003E-2]
[null,null,null,null,null,null,null,null,{"$f":"IFERROR(IF(AND(Forside!$D$12<=J83,Forside!$D$12+Betragtningstid-1>=Bygning!J83),\"x\",\"\"),\"\")","v":""},2096,4.0300000000000002E-2,6.8040000000000003E-2]
[null,null,null,null,null,null,null,null,{"$f":"IFERROR(IF(AND(Forside!$D$12<=J84,Forside!$D$12+Betragtningstid-1>=Bygning!J84),\"x\",\"\"),\"\")","v":""},2097,4.0300000000000002E-2,6.8040000000000003E-2]
[null,null,null,null,null,null,null,null,{"$f":"IFERROR(IF(AND(Forside!$D$12<=J85,Forside!$D$12+Betragtningstid-1>=Bygning!J85),\"x\",\"\"),\"\")","v":""},2098,4.0300000000000002E-2,6.8040000000000003E-2]
[null,null,null,null,null,null,null,null,{"$f":"IFERROR(IF(AND(Forside!$D$12<=J86,Forside!$D$12+Betragtningstid-1>=Bygning!J86),\"x\",\"\"),\"\")","v":""},2099,4.0300000000000002E-2,6.8040000000000003E-2]
[null,null,null,null,null,null,null,null,{"$f":"IFERROR(IF(AND(Forside!$D$12<=J87,Forside!$D$12+Betragtningstid-1>=Bygning!J87),\"x\",\"\"),\"\")","v":""},2100,4.0300000000000002E-2,6.8040000000000003E-2]
[null,null,null,null,null,null,null,null,{"$f":"IFERROR(IF(AND(Forside!$D$12<=J88,Forside!$D$12+Betragtningstid-1>=Bygning!J88),\"x\",\"\"),\"\")","v":""},2101,4.0300000000000002E-2,6.8040000000000003E-2]
[null,null,null,null,null,null,null,null,{"$f":"IFERROR(IF(AND(Forside!$D$12<=J89,Forside!$D$12+Betragtningstid-1>=Bygning!J89),\"x\",\"\"),\"\")","v":""},2102,4.0300000000000002E-2,6.8040000000000003E-2]
[null,null,null,null,null,null,null,null,{"$f":"IFERROR(IF(AND(Forside!$D$12<=J90,Forside!$D$12+Betragtningstid-1>=Bygning!J90),\"x\",\"\"),\"\")","v":""},2103,4.0300000000000002E-2,6.8040000000000003E-2]
[null,null,null,null,null,null,null,null,{"$f":"IFERROR(IF(AND(Forside!$D$12<=J91,Forside!$D$12+Betragtningstid-1>=Bygning!J91),\"x\",\"\"),\"\")","v":""},2104,4.0300000000000002E-2,6.8040000000000003E-2]
[null,null,null,null,null,null,null,null,{"$f":"IFERROR(IF(AND(Forside!$D$12<=J92,Forside!$D$12+Betragtningstid-1>=Bygning!J92),\"x\",\"\"),\"\")","v":""},2105,4.0300000000000002E-2,6.8040000000000003E-2]
[null,null,null,null,null,null,null,null,{"$f":"IFERROR(IF(AND(Forside!$D$12<=J93,Forside!$D$12+Betragtningstid-1>=Bygning!J93),\"x\",\"\"),\"\")","v":""},2106,4.0300000000000002E-2,6.8040000000000003E-2]
[null,null,null,null,null,null,null,null,{"$f":"IFERROR(IF(AND(Forside!$D$12<=J94,Forside!$D$12+Betragtningstid-1>=Bygning!J94),\"x\",\"\"),\"\")","v":""},2107,4.0300000000000002E-2,6.8040000000000003E-2]
[null,null,null,null,null,null,null,null,{"$f":"IFERROR(IF(AND(Forside!$D$12<=J95,Forside!$D$12+Betragtningstid-1>=Bygning!J95),\"x\",\"\"),\"\")","v":""},2108,4.0300000000000002E-2,6.8040000000000003E-2]
[null,null,null,null,null,null,null,null,{"$f":"IFERROR(IF(AND(Forside!$D$12<=J96,Forside!$D$12+Betragtningstid-1>=Bygning!J96),\"x\",\"\"),\"\")","v":""},2109,4.0300000000000002E-2,6.8040000000000003E-2]
[null,null,null,null,null,null,null,null,{"$f":"IFERROR(IF(AND(Forside!$D$12<=J97,Forside!$D$12+Betragtningstid-1>=Bygning!J97),\"x\",\"\"),\"\")","v":""},2110,4.0300000000000002E-2,6.8040000000000003E-2]
[null,null,null,null,null,null,null,null,{"$f":"IFERROR(IF(AND(Forside!$D$12<=J98,Forside!$D$12+Betragtningstid-1>=Bygning!J98),\"x\",\"\"),\"\")","v":""},2111,4.0300000000000002E-2,6.8040000000000003E-2]
[null,null,null,null,null,null,null,null,{"$f":"IFERROR(IF(AND(Forside!$D$12<=J99,Forside!$D$12+Betragtningstid-1>=Bygning!J99),\"x\",\"\"),\"\")","v":""},2112,4.0300000000000002E-2,6.8040000000000003E-2]
[null,null,null,null,null,null,null,null,{"$f":"IFERROR(IF(AND(Forside!$D$12<=J100,Forside!$D$12+Betragtningstid-1>=Bygning!J100),\"x\",\"\"),\"\")","v":""},2113,4.0300000000000002E-2,6.8040000000000003E-2]
[null,null,null,null,null,null,null,null,{"$f":"IFERROR(IF(AND(Forside!$D$12<=J101,Forside!$D$12+Betragtningstid-1>=Bygning!J101),\"x\",\"\"),\"\")","v":""},2114,4.0300000000000002E-2,6.8040000000000003E-2]
[null,null,null,null,null,null,null,null,{"$f":"IFERROR(IF(AND(Forside!$D$12<=J102,Forside!$D$12+Betragtningstid-1>=Bygning!J102),\"x\",\"\"),\"\")","v":""},2115,4.0300000000000002E-2,6.8040000000000003E-2]
[null,null,null,null,null,null,null,null,{"$f":"IFERROR(IF(AND(Forside!$D$12<=J103,Forside!$D$12+Betragtningstid-1>=Bygning!J103),\"x\",\"\"),\"\")","v":""},2116,4.0300000000000002E-2,6.8040000000000003E-2]
[null,null,null,null,null,null,null,null,{"$f":"IFERROR(IF(AND(Forside!$D$12<=J104,Forside!$D$12+Betragtningstid-1>=Bygning!J104),\"x\",\"\"),\"\")","v":""},2117,4.0300000000000002E-2,6.8040000000000003E-2]
[null,null,null,null,null,null,null,null,{"$f":"IFERROR(IF(AND(Forside!$D$12<=J105,Forside!$D$12+Betragtningstid-1>=Bygning!J105),\"x\",\"\"),\"\")","v":""},2118,4.0300000000000002E-2,6.8040000000000003E-2]
[null,null,null,null,null,null,null,null,{"$f":"IFERROR(IF(AND(Forside!$D$12<=J106,Forside!$D$12+Betragtningstid-1>=Bygning!J106),\"x\",\"\"),\"\")","v":""},2119,4.0300000000000002E-2,6.8040000000000003E-2]
[null,null,null,null,null,null,null,null,{"$f":"IFERROR(IF(AND(Forside!$D$12<=J107,Forside!$D$12+Betragtningstid-1>=Bygning!J107),\"x\",\"\"),\"\")","v":""},2120,4.0300000000000002E-2,6.8040000000000003E-2]
[null,null,null,null,null,null,null,null,{"$f":"IFERROR(IF(AND(Forside!$D$12<=J108,Forside!$D$12+Betragtningstid-1>=Bygning!J108),\"x\",\"\"),\"\")","v":""},2121,4.0300000000000002E-2,6.8040000000000003E-2]
[null,null,null,null,null,null,null,null,{"$f":"IFERROR(IF(AND(Forside!$D$12<=J109,Forside!$D$12+Betragtningstid-1>=Bygning!J109),\"x\",\"\"),\"\")","v":""},2122,4.0300000000000002E-2,6.8040000000000003E-2]
[null,null,null,null,null,null,null,null,{"$f":"IFERROR(IF(AND(Forside!$D$12<=J110,Forside!$D$12+Betragtningstid-1>=Bygning!J110),\"x\",\"\"),\"\")","v":""},2123,4.0300000000000002E-2,6.8040000000000003E-2]
[null,null,null,null,null,null,null,null,{"$f":"IFERROR(IF(AND(Forside!$D$12<=J111,Forside!$D$12+Betragtningstid-1>=Bygning!J111),\"x\",\"\"),\"\")","v":""},2124,4.0300000000000002E-2,6.8040000000000003E-2]
[null,null,null,null,null,null,null,null,{"$f":"IFERROR(IF(AND(Forside!$D$12<=J112,Forside!$D$12+Betragtningstid-1>=Bygning!J112),\"x\",\"\"),\"\")","v":""},2125,4.0300000000000002E-2,6.8040000000000003E-2]
[null,null,null,null,null,null,null,null,{"$f":"IFERROR(IF(AND(Forside!$D$12<=J113,Forside!$D$12+Betragtningstid-1>=Bygning!J113),\"x\",\"\"),\"\")","v":""},2126,4.0300000000000002E-2,6.8040000000000003E-2]
[null,null,null,null,null,null,null,null,{"$f":"IFERROR(IF(AND(Forside!$D$12<=J114,Forside!$D$12+Betragtningstid-1>=Bygning!J114),\"x\",\"\"),\"\")","v":""},2127,4.0300000000000002E-2,6.8040000000000003E-2]
[null,null,null,null,null,null,null,null,{"$f":"IFERROR(IF(AND(Forside!$D$12<=J115,Forside!$D$12+Betragtningstid-1>=Bygning!J115),\"x\",\"\"),\"\")","v":""},2128,4.0300000000000002E-2,6.8040000000000003E-2]
[null,null,null,null,null,null,null,null,{"$f":"IFERROR(IF(AND(Forside!$D$12<=J116,Forside!$D$12+Betragtningstid-1>=Bygning!J116),\"x\",\"\"),\"\")","v":""},2129,4.0300000000000002E-2,6.8040000000000003E-2]
[null,null,null,null,null,null,null,null,{"$f":"IFERROR(IF(AND(Forside!$D$12<=J117,Forside!$D$12+Betragtningstid-1>=Bygning!J117),\"x\",\"\"),\"\")","v":""},2130,4.0300000000000002E-2,6.8040000000000003E-2]
[null,null,null,null,null,null,null,null,{"$f":"IFERROR(IF(AND(Forside!$D$12<=J118,Forside!$D$12+Betragtningstid-1>=Bygning!J118),\"x\",\"\"),\"\")","v":""},2131,4.0300000000000002E-2,6.8040000000000003E-2]
[null,null,null,null,null,null,null,null,{"$f":"IFERROR(IF(AND(Forside!$D$12<=J119,Forside!$D$12+Betragtningstid-1>=Bygning!J119),\"x\",\"\"),\"\")","v":""},2132,4.0300000000000002E-2,6.8040000000000003E-2]
[null,null,null,null,null,null,null,null,{"$f":"IFERROR(IF(AND(Forside!$D$12<=J120,Forside!$D$12+Betragtningstid-1>=Bygning!J120),\"x\",\"\"),\"\")","v":""},2133,4.0300000000000002E-2,6.8040000000000003E-2]
[null,null,null,null,null,null,null,null,{"$f":"IFERROR(IF(AND(Forside!$D$12<=J121,Forside!$D$12+Betragtningstid-1>=Bygning!J121),\"x\",\"\"),\"\")","v":""},2134,4.0300000000000002E-2,6.8040000000000003E-2]
[null,null,null,null,null,null,null,null,{"$f":"IFERROR(IF(AND(Forside!$D$12<=J122,Forside!$D$12+Betragtningstid-1>=Bygning!J122),\"x\",\"\"),\"\")","v":""},2135,4.0300000000000002E-2,6.8040000000000003E-2]
[null,null,null,null,null,null,null,null,{"$f":"IFERROR(IF(AND(Forside!$D$12<=J123,Forside!$D$12+Betragtningstid-1>=Bygning!J123),\"x\",\"\"),\"\")","v":""},2136,4.0300000000000002E-2,6.8040000000000003E-2]
[null,null,null,null,null,null,null,null,{"$f":"IFERROR(IF(AND(Forside!$D$12<=J124,Forside!$D$12+Betragtningstid-1>=Bygning!J124),\"x\",\"\"),\"\")","v":""},2137,4.0300000000000002E-2,6.8040000000000003E-2]
[null,null,null,null,null,null,null,null,{"$f":"IFERROR(IF(AND(Forside!$D$12<=J125,Forside!$D$12+Betragtningstid-1>=Bygning!J125),\"x\",\"\"),\"\")","v":""},2138,4.0300000000000002E-2,6.8040000000000003E-2]
[null,null,null,null,null,null,null,null,{"$f":"IFERROR(IF(AND(Forside!$D$12<=J126,Forside!$D$12+Betragtningstid-1>=Bygning!J126),\"x\",\"\"),\"\")","v":""},2139,4.0300000000000002E-2,6.8040000000000003E-2]
[null,null,null,null,null,null,null,null,{"$f":"IFERROR(IF(AND(Forside!$D$12<=J127,Forside!$D$12+Betragtningstid-1>=Bygning!J127),\"x\",\"\"),\"\")","v":""},2140,4.0300000000000002E-2,6.8040000000000003E-2]
[null,null,null,null,null,null,null,null,{"$f":"IFERROR(IF(AND(Forside!$D$12<=J128,Forside!$D$12+Betragtningstid-1>=Bygning!J128),\"x\",\"\"),\"\")","v":""},2141,4.0300000000000002E-2,6.8040000000000003E-2]
[null,null,null,null,null,null,null,null,{"$f":"IFERROR(IF(AND(Forside!$D$12<=J129,Forside!$D$12+Betragtningstid-1>=Bygning!J129),\"x\",\"\"),\"\")","v":""},2142,4.0300000000000002E-2,6.8040000000000003E-2]
[null,null,null,null,null,null,null,null,{"$f":"IFERROR(IF(AND(Forside!$D$12<=J130,Forside!$D$12+Betragtningstid-1>=Bygning!J130),\"x\",\"\"),\"\")","v":""},2143,4.0300000000000002E-2,6.8040000000000003E-2]
[null,null,null,null,null,null,null,null,{"$f":"IFERROR(IF(AND(Forside!$D$12<=J131,Forside!$D$12+Betragtningstid-1>=Bygning!J131),\"x\",\"\"),\"\")","v":""},2144,4.0300000000000002E-2,6.8040000000000003E-2]
[null,null,null,null,null,null,null,null,{"$f":"IFERROR(IF(AND(Forside!$D$12<=J132,Forside!$D$12+Betragtningstid-1>=Bygning!J132),\"x\",\"\"),\"\")","v":""},2145,4.0300000000000002E-2,6.8040000000000003E-2]
[null,null,null,null,null,null,null,null,{"$f":"IFERROR(IF(AND(Forside!$D$12<=J133,Forside!$D$12+Betragtningstid-1>=Bygning!J133),\"x\",\"\"),\"\")","v":""},2146,4.0300000000000002E-2,6.8040000000000003E-2]
[null,null,null,null,null,null,null,null,{"$f":"IFERROR(IF(AND(Forside!$D$12<=J134,Forside!$D$12+Betragtningstid-1>=Bygning!J134),\"x\",\"\"),\"\")","v":""},2147,4.0300000000000002E-2,6.8040000000000003E-2]
[null,null,null,null,null,null,null,null,{"$f":"IFERROR(IF(AND(Forside!$D$12<=J135,Forside!$D$12+Betragtningstid-1>=Bygning!J135),\"x\",\"\"),\"\")","v":""},2148,4.0300000000000002E-2,6.8040000000000003E-2]
[null,null,null,null,null,null,null,null,{"$f":"IFERROR(IF(AND(Forside!$D$12<=J136,Forside!$D$12+Betragtningstid-1>=Bygning!J136),\"x\",\"\"),\"\")","v":""},2149,4.0300000000000002E-2,6.8040000000000003E-2]
[null,null,null,null,null,null,null,null,{"$f":"IFERROR(IF(AND(Forside!$D$12<=J137,Forside!$D$12+Betragtningstid-1>=Bygning!J137),\"x\",\"\"),\"\")","v":""},2150,4.0300000000000002E-2,6.8040000000000003E-2]
[]
[null,null,null,null,null,null,null,null,null,"Middel",{"$f":"AVERAGEIF($I$2:$I$137,\"x\",K2:K137)","v":5.5540000000000089E-2},{"$f":"AVERAGEIF($I$2:$I$137,\"x\",L2:L137)","v":7.1857439999999967E-2}]